{"text_format":"1","workbook":"xlsx","n_sheets":23,"sheets":["0 - Methodo","Présentation","1 - Lisez-moi","2 - Identifiez-vous","3 - Saisie","4 - Résultats","5 - Conformité par DCI","TCDDCICONF","GBP V4","Liste","Calcul","GBP V4 (29012025)","Références bibliographiques","Listes","Référentiel_pour_Sphinx","TCDSUPCONF","TCDSUP","TCDCONF","TCDADMCONF","TCDADM","TCDSERV","TCDSERVCONF","ETB"],"not_rendered":{"charts":10,"images":10,"macros":1,"external_links":1,"defined_names":39,"comments":0,"pivot_tables":8},"unopened":[],"bounds":{"document_bytes":16777216,"sheet_cells":100000,"rows_first":2000,"rows_last":500,"rows_between":2000,"halvings":0,"cell_chars":16384,"cell_head_chars":4096},"cells_cut":0,"cells_raw":0,"read":"whole","date_system":"1900"}

{"sheet":"0 - Methodo","index":0,"n_rows":25,"n_cols":2,"rows_kept":25,"cut":false,"hidden":false,"merged":[[1,1,2,1],[18,1,19,1],[24,1,27,1],[5,1,6,1],[7,1,8,1],[13,1,15,1],[16,1,17,1]]}
[null,"Programme EPP / AAPP selon méthodologie HAS :"]
[null,"AAPP sur les Prescriptions de Perfusion à Domicile  \n(Prescriptions Hospitalières exécutées En Ville (PHEV))"]
[]
[null,"Domaine / thématique choisie \nPrescriptions hospitalières de Pefusion à Domicile exécutées en ville                                                                                                                                                                                                                  "]
[null,"Type de démarche Audit clinique, Audit clinique ciblé                                                                                                                                                                                                                                                                                                                                             "]
[null,"Calendrier régional : \n\n03/06/2025 : Webinaire ARS, AM, OMEDIT sur la prise en main de l'outil\n\nJuin - Juillet - Août : réalisation de l'audit par les établissements concernés\n\n12/09/2025 : renvoi et analyse des résultats par l'OMEDIT IDF\n\nOctobre : restitution régionale et présentation des actions à mettre en place selon les besoins identifiés\n"]
[]
[null,"Mode de recueil et d'analyse des données \nIl s'agit d'un audit clinique de pratique prospectif ou rétrospectif, pluridisciplinaire (médecins, pharmaciens, soignants, encadrement...). La participation d'un médecin (pas nécessairement le prescripteur) est requise.\nL'audit porte sur l'ordonnance de Perfusion à Domicile de médicaments administrés par voie veineuse ou sous-cutanée concernés par les forfaits PERFADOM de la LPP (hors ordonnance d'insulinothérapie ou de nutrition parentérale), en sortie d'hospitalisation ou en consultation externe, en vue d'une délivrance en ville et d'une poursuite des soins à domicile. \nNB : Pour l'audit, un patient ne pourra être inclu qu'une seule fois.\n\nNombre d'ordonnances à auditer \n- Tranche de 1 à 299 patients éligibles* : 20 ordonnances \n- Tranche de 300 à 799 patients éligibles* : 30 ordonnances\n- Tranche de 800 à 999 patients éligibles*  : 40 ordonnances\n- > 1 000 patients éligibles* : 50 ordonnances\n*patients de l'établissement ayant eu une PHEV de forfaits PERFADOM sur l'année 2019 (hors ordonnance d'insulinothérapie ou de nutrition parentérale). \n\nSelon la norme ISO 2859-1 "]
[]
[null,"Référence(s) et/ou recommandations utilisée(s)          "]
[null,"      LPP, code de la santé publique, code de la sécurité sociale, référentiel de prescription du RESOMEDIT                                                                                                                                                                                      "]
[null,"Résultats en termes d'amélioration des pratiques     "]
[null,"      Objectifs : amélioration de la pertinence des modes de perfusion à domicile prescrits afin d'optimiser les soins dispensés à domicile et en vue d'une réduction des dépenses de l'Assurance Maladie non justifiées.                                                                                                                                                                                    "]
[null,"Points forts observés, points à améliorer\nDéfinir des priorités et des actions d'amélioration\nBrainstorming régional"]
[]
[]
[null,"Développements ultérieurs envisagés\nAction d'amélioration de la pertinence des prescriptions de forfaits PERFADOM"]
[]
[null,"Lien avec le programme pluriannuel d’amélioration de la qualité et de la sécurité des soins de l’établissement\nAAPP à mettre en lien avec le CAQES, le PAQSS et la certification des établissements de santé"]
[]
[null,"Actions de communication\nCommunication au sein de l'établissement et régionale (ARS, OMEDIT, assurance maladie)"]
[]
[]
[]
[null,"Professionnels engagés dans le programme\nMédecins, pharmaciens, préparateurs en pharmacie, IDE, Cadres de santé, direction de la qualité, responsable RSMQ…"]

{"sheet":"Présentation","index":1,"n_rows":47,"n_cols":3,"rows_kept":47,"cut":false,"hidden":false,"merged":[[14,0,15,0],[14,1,15,1],[17,0,19,0],[20,0,20,2],[21,0,21,2],[10,0,11,0],[10,2,11,2],[0,0,0,2],[2,0,2,2],[3,0,5,2],[7,0,8,0],[7,2,8,2]]}
["PERFADOM"]
[]
["Principes de l'outil PERFADOM"]
["La perfusion à domicile concerne l’administration de médicaments par perfusion intraveineuse (abord central ou périphérique), sous-cutanée ou péri-nerveuse, au domicile des patients. La nomenclature de la perfusion à domicile admet au remboursement les perfusions réalisées selon 3 modes d’administration : gravité, diffuseur et système actif électrique (pompe ou pousse-seringue). L'administration de traitements à domicile doit se faire dans le respect des recommandations de bonnes pratiques des modes d'administration (https://www.euro-pharmat.com/fiches-de-bon-usage). Par exemple pour le diffuseur, la pose et la dépose nécessitent des règles de bonnes pratiques (hygiène, vérification de l'absence de volume résiduel non administré, ...) (cf https://ressources-aura.fr/wp-content/uploads/2022/12/BPA-2211-DIFFUSEUR.pdf).\nLa définition de critères de pertinence des modes de perfusion à domicile et des recommandations a permis au réseau des OMéDIT (ResOMéDIT) d'élaborer un arbre décisionnel et un guide de bonnes pratiques complémentaires et indissociables.\nMalgré les soins apportés à la rédaction et à la relecture de ce guide, les auteurs déclinent, selon l'usage, toutes responsabilités pour les conséquences pouvant résulter d'une erreur. Pour une information complète se référer aux RCP en vigueur."]
[]
[]
["Recommandations","Choix du comité de rédaction","Argumentation"]
[1,"Périmètre / Population concernée : adulte","Les modalités de prescription et de perfusion chez l'enfant répondent à des modalités de prescription spécifiques (prescription en mg/kg) et respectant des critères de sécurité et de dilution différents (volume max par exemple)."]
[null,"Le présent guide n’intègre pas la population pédiatrique"]
[2,"Périmètre / Médicaments concernés : médicaments les plus souvent prescrits à domicile","L'objectif est de définir des pratiques harmonisées garantissant une sécurité de perfusion pour les médicaments injectables couramment administrés à domicile. Ces médicaments concernent les médicaments disponibles en pharmacie de ville et à l'hôpital inscrits sur la liste de rétrocession. Les médicaments réservés à l'usage hospitalier doivent être administrés en HAD. Ils ne sont donc pas pris en compte dans la nomenclature \"LPP Perfadom\". A noter, ce guide de bonnes pratiques n’intègre pas de priorisation en fonction du potentiel risque iatrogène de chaque médicament."]
[3,"Posologie : exprimée en dose associée à une fréquence (et non en dose journalière). ","L'objectif est de faciliter le remplissage du « FORMULAIRE DE PRESCRIPTION DE PERFUSION À DOMICILE (VILLE OU HÔPITAL) » (source : Ameli) en « collant » au plus proche des informations requises. "]
[null,"A noter, seules les posologies « standards et fortes posologies » recommandées par la SPILF/SFPT/CA-SFM sont renseignées. Il peut être nécessaire d’adapter ces dernières selon les caractéristiques du patient (par ex. : âge, poids, fonction rénale ou fonction hépatique) ou encore, notamment pour les anti-infectieux, selon l’indication, la sévérité de l’infection, le site et le type d’infection, le pathogène, la sensibilité bactérienne ou le suivi thérapeutique pharmacologique."]
[4,"Reconstitution : liste restrictive de solvants (identifiés et validés dans les RCP) : eau PPI et NaCl 0,9%","L'objectif est de prioriser et d'harmoniser les pratiques au plus proche des RCP. Le recours à l'eau PPI est justifié par les RCP et au NaCl 0,9 % compte tenu de sa faible criticité en terme d'incompatibilités physico-chimiques. Dans certaines circonstances, un solvant différent de celui mentionné dans ce guide peut être utilisé conformément aux RCP."]
[5,"Dilution : pour les perfusions par gravité un volume minimum de 100 mL est à privilégier","L'objectif est de garantir une administration de la dose totale de médicament, en particulier en cas de rinçage insuffisant de la tubulure."]
[6,"Voie d'abord : voie IV. SC et périnerveuse","Le guide est ciblé sur la perfusion à domicile et non sur les modalités d'administration des médicaments. "]
[null,null,"Si une voie complémentaire est autorisée (validée par les RCP ou une source documentaire), celle-ci figure dans la colonne \"commentaire\". "]
[7,"Mode d'administration : pour chaque dose identifiée, un mode « préconisé » de perfusion a été défini en 1ère intention. Si plusieurs modalités de perfusion sont envisageables, une priorisation des pratiques a été effectuée : perfusion par gravité, perfusion en diffuseur (s'assurer de la stabilité médicamenteuse et de la compatibilité des matériaux des diffuseurs, selon les données du fournisseur ou du fabricant) et perfusion par système actif électrique conformément aux préconisations du formulaire de prescription de perfusion à domicile","Ce travail vise à harmoniser les pratiques et s'inscrit dans un objectif :\n- de priorisation des bonnes pratiques de prise en charge (cf arbre décisionnel)\n- associée à une réduction des dépenses (limitation de l'utilisation des systèmes actifs).\nQuelque soit le mode de perfusion à domicile, l'administration doit se faire au regard d'une posologie (dose et fréquence)\n"]
[8,"Références bibliographiques : "]
[null,"·         FOND : guide élaboré à partir d’une base documentaire commune comprenant notamment : les RCP (base de donnée publique des médicaments du Ministère des solidarités et de la santé ; Thériaque), Stabilis, données HUG (hôpitaux Universitaires de Genève), guide SPILF.","·         FOND : Ces sources sont considérées comme fiables et suffisantes à l'élaboration du guide."]
[null,"·         FORME :  la colonne L « Références Bibliographiques » de l’onglet « Guide de bonnes pratiques » présente les principales sources utilisées pour chacun des médicaments. A noter, certaines références ont été codifiées. Ces codes renvoient vers l’onglet spécifique « références bibliographiques », où le détail de la source est mentionnée (et un lien précisé le cas échéant)."]
[]
["Abréviations"]
["5FU","5 Fluoro Uracile"]
["BPPH","Bonnes Pratiques de Préparations Hospitalières"]
["Cmax","Concentration maximale"]
["DCI","Dénomination Commune Internationale"]
["EPPI","Eau Pour Préparation Injectable"]
["G5%","Glucose 5%"]
["HAD","Hospitalisation A Domicile"]
["IM","Intra Musculaire"]
["IR","Insuffisance rénale"]
["IV","Intra Veineuse"]
["IVD","Intraveineuse directe"]
["LPP","Liste des Produits et Prestations"]
["min","Minutes"]
["NaCl","Chlorure de Sodium"]
["PCA","Analgésie Contrôlée par le Patient"]
["PH","Prescription Hospitalière"]
["PK/PD","Pharmacocinétique/Pharmacodynamie"]
["PSE","Pousse Seringue Electrique"]
["PUI","Pharmacie à usage intérieur"]
["RCP","Résumé Caractéristiques Produits"]
["SFP","Sensibles à forte posologie"]
["SC","Sous Cutanée"]
["vol mini","Volume minimal"]
["VVC","Voie veineuse centrale"]
["VVP","Voie veineuse périphérique"]

{"sheet":"1 - Lisez-moi","index":2,"n_rows":107,"n_cols":10,"rows_kept":107,"cut":false,"hidden":false,"merged":[[23,2,23,10],[7,1,9,11],[24,2,24,10],[6,1,6,11],[1,1,5,11],[89,3,89,11],[91,2,92,2],[94,2,95,2],[52,2,53,10],[87,3,87,10],[81,1,83,10],[86,3,86,11]]}
[]
[null,"Fichier AAPP sur les Prescriptions de Perfusion à Domicile et méthodologie proposés par l'"]
[]
[]
[]
[]
[null,"Lisez - moi : Explication de la procédure "]
[null,"AVANT de saisir vos données, enregistrez ce fichier sur votre disque dur \nsous le NOM de l'établissement + service + EPP-PERFADOM + Année\nEx. : HOPITALserviceevalEPP-PERFADOM2025.xls"]
[]
[]
[]
[null,"Cet outil informatique a été conçu pour vous permettre de :"]
[null,"* Saisir informatiquement vos données "]
[null,"* Représenter graphiquement vos résultats"]
[]
[]
[null,"ONGLET 1","LISEZ-MOI",null,null,null,"Version du référentiel utilisée :",null,null,"29/01/2025 (V4)"]
[null,"ONGLET 2","IDENTIFIEZ-VOUS"]
[null,"ONGLET 3","SAISIE"]
[null,"ONGLET 4","RESULTATS"]
[null,"ONGLET 5","CONFORMITE PAR DCI"]
[null,"ONGLET 6","REFERENTIEL du RESOMEDIT"]
[]
[null,null,"Pensez à activer les macros du fichier avant son utilisation"]
[null,null,"Des problèmes de compatibilités peuvent avoir lieu avec les versions d'excel antérieures à office 2013"]
[]
[null,null,"ONGLET 2 IDENTIFIEZ-VOUS - Saisissez les informations de votre établissement"]
[]
[]
[null,null,"ONGLET 3 SAISIE - Renseignez le service prescripteur, la date de prescription et l'identification du prescripteur"]
[null,null,"La saisie de ces informations est en texte libre. Elle est facultative."]
[null,null,"En cas de saisie de l'identification du prescripteur, utiliser un code permettant une identification en interne uniquement."]
[null,null,"Eviter la saisie d'un nom ou d'un numéro RPPS."]
[null,null,"ONGLET 3 SAISIE - Saisissez le type de support de prescription utilisé à l'aide du menu déroulant"]
[]
[]
[]
[]
[null,null,null,null,"puis"]
[]
[]
[]
[null,null,"Une ordonnance libre correspond à toute ordonnance rédigée par le prescripteur à partir de libellés en saisie semi-automatique ou non."]
[null,null,"Le type de support de prescription correspond à la méthode de saisie (informatique, manuscrite ou issu d'un formulaire avec case à cocher)."]
[]
[null,null,"ONGLET 3 SAISIE - Saisissez le nom du produit et la dose par administration"]
[]
[null,null,"Recherchez la DCI du médicament administré :"]
[null,null,"Dans la cellule de la colonne \"DCI\", saisissez plusieurs lettres (sans accent de préférence) de la DCI recherchée."]
[null,null,"Il peut s'agir de lettres se situant au milieu du nom"]
[null,null,"Par exemple : pour rechercher de l'AMOXICILLINE ACIDE CLAVULANIQUE  il est possible de saisir \"CLAV\""]
[null,null,"Utiliser préférentiellement des ordonnances ne comportant qu'une seule DCI (hors solvant) pour renseigner cet audit"]
[null,null,"Si le médicament prescrit n'apparait pas dans la liste déroulante l'option \"MEDICAMENT NON INTEGRE AU REFERENTIEL DU ResOMeDIT\" doit être sélectionnée. Merci alors de renseigner la DCI dans la colonne \"Argumentaire\"."]
[]
[]
[null,null,"Sélectionnez la dose par administration depuis le menu déroulant."]
[null,null,"Pour tous médicaments, excepté le Méropénème, la dose n'a pas d'impact sur le(s) mode(s) d'administration conforme(s). "]
[null,null," Pour ces médicaments, l'option \"toutes doses\" doit être choisie."]
[null,null,"Si la dose par administration n'est pas renseignée sur la prescription, choisir \"Dose non Renseignée\" dans le menu déroulant"]
[null,null,"afin de ne pas laisser la cellule vide"]
[null,null,"Si la dose par administration ne correspond pas à l'une des doses proposées par l'outil, choisir l'option \"autre dose\" "]
[null,null,"et renseigner le détail de la dose dans la colonne \"Argumentaire\""]
[null,null,"Pour les \"MEDICAMENT NON INTEGRE AU GUIDE DU ResOMeDIT\", si la dose est disponible, choisir l'option \"Toutes doses\""]
[null,null,"et renseigner le détail de la dose dans la colonne \"Argumentaire\""]
[]
[null,null,"Une cellule colorée en jaune doit être renseignée"]
[]
[null,null,"ONGLET 3 SAISIE - Renseignez le mode d'administration à l'aide du menu déroulant"]
[]
[null,null,null,null,"Si le mode d'administration n'est pas renseigné sur la prescription choisir \"Non Renseigné\" "]
[null,null,null,null,"dans le menu déroulant"]
[]
[]
[]
[]
[]
[]
[null,null,"Une cellule colorée en jaune doit être renseignée"]
[]
[null,null,"ONGLET 3 SAISIE - Résultats"]
[]
[null,"L'outil génère automatiquement la conformité ou non de la prescription selon le guide \"PERFADOM\" du ResOMéDIT.\nL'outil indique aussi les éventuels autres modes de perfusion conformes et les modalités alternatives acceptables"]
[]
[]
[]
[null,null,"Conformité du mode d'administration","Les éléments saisis sont conformes au guide"]
[null,null,"Conformité du mode d'administration / Divergence dans la prescription","Le mode saisi est conforme au guide mais le type d'administration (continue ou discontinue) ne correspond pas au mode choisi"]
[null,null,"Modalité alternative d'administration","Les éléments saisis correspondent aux modalités alternatives proposées par le reférentiel\nCette modalité est conforme mais son usage doit être justifié"]
[null,null,"Non Conformité du mode d'administration","Les éléments saisis sont non conformes au guide du ResOMeDIT"]
[null,null,"Non Conformité du mode d'administration / Divergence dans la prescription","Le mode saisi est non conforme au guide et le type d'administration (continue ou discontinue) ne correspond pas au mode choisi"]
[null,null,"Non Conformité : Prescription Incomplète","La dose et/ou le mode d'administration n'ont pas été renseignés sur le support de prescription"]
[null,null,"Situation non intégrée  dans le référentiel","Les éléments saisis correspondent à une DCI ou une association DCI/dose non présente dans le guide\n"]
[null,null,null,"Merci de renseigner la colonne \"Argumentaire\" avec la DCI et/ou la dose et/ou le mode de perfusion ainsi "]
[null,null," ResOMeDIT","que le rationnel pour permettre une mise à jour du référentiel"]
[null,null,"Saisie Incomplète","La dose et/ou le mode d'administration n'ont pas été saisis dans l'EPP"]
[null,null,null,"Il est important de limiter au maximum l'utilisation de cette modalité"]
[]
[null,null,"ONGLET 4 RESULTATS  - Présentation des résultats"]
[null,null,"La mise à jour des résultats peut prendre quelques secondes lors de l'affichage de cet onglet"]
[]
[]
[null,null,"ONGLET 5 CONFORMITE PAR DCI  - Présentation des taux de conformité et de non-conformité par DCI."]
[null,null,"La mise à jour des résultats peut prendre quelques secondes lors de l'affichage de cet onglet"]
[null,null,"Les DCI intégrées au référentiel mais qui n'ont pas fait l'objet de prescriptions n'apparaissent pas dans le tableau présenté dans cet onglet."]
[]
[null,null,"ONGLET 6 REFERENTIEL  - Présentation du référentiel du RESOMEDIT"]
[null,null,"L'intégralité du référentiel du RESOMEDIT à jour à la date de publication de l'outil."]

{"sheet":"2 - Identifiez-vous","index":3,"n_rows":26,"n_cols":6,"rows_kept":26,"cut":false,"hidden":false,"merged":[[11,0,11,7],[0,0,1,7],[2,0,6,0],[2,1,6,7],[7,0,7,7],[9,0,9,7],[24,3,24,4],[24,6,24,7],[25,3,25,4],[25,6,25,7],[13,2,13,7],[14,2,14,7],[20,0,20,7],[22,2,22,7],[23,3,23,4],[23,6,23,7]]}
[]
[]
[null,"Audit et Amélioration des Pratiques Professionnelles (AAPP) \n-\nPERFADOM"]
[]
[]
[]
[]
[]
[]
["Informations générales"]
[]
["Identité de l'établissement"]
[]
["Nom de l'établissement",null,"Catégorie de l'établissement"]
[]
[]
["Finess géographique"]
[]
[]
[]
["Informations sur l'EPP"]
[]
["Date de saisie des données",null,"Nom / fonction du/des auditeur(s)"]
[null,null,"Evaluateur 1",null,null,"Fonction"]
[null,null,"Evaluateur 2",null,null,"Fonction"]
[null,null,"Evaluateur 3",null,null,"Fonction"]

{"sheet":"3 - Saisie","index":4,"n_rows":107,"n_cols":21,"rows_kept":107,"cut":false,"hidden":false,"merged":[[0,5,4,12]]}
[null,null,null,null,null,"Audit et Amélioration des Pratiques Professionnelles (AAPP) \n-\nPERFADOM"]
[]
[null,null,null,null,null,null,null,null,null,null,null,null,null,"FINESS"]
[]
[]
[]
[null,"Prescription","Service Prescripteur","Date de prescription","Identification du prescripteur","Format du support de prescription","Type de support de prescription","DCI","Dose journalière","Administration","Mode d'administration","Conformité","confcal","Argumentaire","Préconisations","Précocal","Modalité de Perfusion Alternative","modcal","classe ATC","Mois de la prescription","Année de la prescription"]
[null,"Prescription N°1",null,null,null,null,null,null,null,null,null,null,{"$f":"IF(H8=\"\",\"\",IF(OR(I8=\"\",J8=\"\",K8=\"\"),\"Saisie Incomplète\",IF(H8=\"\",\"\",\nIF(OR(H8=\"MEDICAMENT NON INTEGRE AU GUIDE DU ResOMeDIT\",K8=\"Hors liste\"),\"Situation non intégrée dans le guide ResOMeDIT\",\nIF(K8=Liste!$B$2,\"Situation non intégrée dans le guide ResOMeDIT\",\nIF(K8=Liste!$B$3,INDEX(Référentiel_pour_Sphinx!$A$1:$U$235,MATCH((H8&I8&\"_\"&J8),Référentiel_pour_Sphinx!$D$1:$D$235,0),17),\nIF(K8=Liste!$B$4,INDEX(Référentiel_pour_Sphinx!$A$1:$U$235,MATCH((H8&I8&\"_\"&J8),Référentiel_pour_Sphinx!$D$1:$D$235,0),18),\nIF(K8=Liste!$B$5,INDEX(Référentiel_pour_Sphinx!$A$1:$U$235,MATCH((H8&I8&\"_\"&J8),Référentiel_pour_Sphinx!$D$1:$D$235,0),19),IF(K8=\"Non Renseigné\",\"Non conformité : Prescription incomplète\",\"Situation non intégrée dans le guide ResOMeDIT\")\n))))))))","v":""},null,null,{"$f":"IF(H8=\"MEDICAMENT NON INTEGRE AU GUIDE DU ResOMeDIT\",\"\",IF(AND(L8<>\"\",L8<>\"Saisie incomplète\"),VLOOKUP(H8&I8,Référentiel_pour_Sphinx!C:G,5,FALSE),\"\"))","v":""},null,{"$f":"IF(H8=\"MEDICAMENT NON INTEGRE AU GUIDE DU ResOMeDIT\",\"\",IF(AND(L8<>\"\",L8<>\"Saisie incomplète\"),IF(K8=\"Gravité\",VLOOKUP(H8&I8,Référentiel_pour_Sphinx!C:O,11,FALSE),IF(K8=\"Diffuseur\",VLOOKUP(H8&I8,Référentiel_pour_Sphinx!C:O,12,FALSE),IF(K8=\"Système Actif Electrique\",VLOOKUP(H8&I8,Référentiel_pour_Sphinx!C:O,13,FALSE),\"\"))),\"\"))","v":""},{"$f":"IF(INDEX(Référentiel_pour_Sphinx!$A$1:$F$235,MATCH(H8,Référentiel_pour_Sphinx!$A$1:$A$235,0),6)=0,\"\",INDEX(Référentiel_pour_Sphinx!$A$1:$F$235,MATCH(H8,Référentiel_pour_Sphinx!$A$1:$A$235,0),6))","v":{"$error":"#N/A"}},{"$f":"IF(D8<>\"\",TEXT(D8,\"mmmm\"),\"\")","v":""},{"$f":"IF(D8<>\"\",YEAR(D8),\"\")","v":""}]
[null,"Prescription N°2",null,null,null,null,null,null,null,null,null,null,{"$f":"IF(H9=\"\",\"\",IF(OR(I9=\"\",J9=\"\",K9=\"\"),\"Saisie Incomplète\",IF(H9=\"\",\"\",\nIF(OR(H9=\"MEDICAMENT NON INTEGRE AU GUIDE DU ResOMeDIT\",K9=\"Hors liste\"),\"Situation non intégrée dans le guide ResOMeDIT\",\nIF(K9=Liste!$B$2,\"Situation non intégrée dans le guide ResOMeDIT\",\nIF(K9=Liste!$B$3,INDEX(Référentiel_pour_Sphinx!$A$1:$U$235,MATCH((H9&I9&\"_\"&J9),Référentiel_pour_Sphinx!$D$1:$D$235,0),17),\nIF(K9=Liste!$B$4,INDEX(Référentiel_pour_Sphinx!$A$1:$U$235,MATCH((H9&I9&\"_\"&J9),Référentiel_pour_Sphinx!$D$1:$D$235,0),18),\nIF(K9=Liste!$B$5,INDEX(Référentiel_pour_Sphinx!$A$1:$U$235,MATCH((H9&I9&\"_\"&J9),Référentiel_pour_Sphinx!$D$1:$D$235,0),19),IF(K9=\"Non Renseigné\",\"Non conformité : Prescription incomplète\",\"Situation non intégrée dans le guide ResOMeDIT\")\n))))))))","v":""},null,null,{"$f":"IF(H9=\"MEDICAMENT NON INTEGRE AU GUIDE DU ResOMeDIT\",\"\",IF(AND(L9<>\"\",L9<>\"Saisie incomplète\"),VLOOKUP(H9&I9,Référentiel_pour_Sphinx!C:G,5,FALSE),\"\"))","v":""},null,{"$f":"IF(H9=\"MEDICAMENT NON INTEGRE AU GUIDE DU ResOMeDIT\",\"\",IF(AND(L9<>\"\",L9<>\"Saisie incomplète\"),IF(K9=\"Gravité\",VLOOKUP(H9&I9,Référentiel_pour_Sphinx!C:O,11,FALSE),IF(K9=\"Diffuseur\",VLOOKUP(H9&I9,Référentiel_pour_Sphinx!C:O,12,FALSE),IF(K9=\"Système Actif Electrique\",VLOOKUP(H9&I9,Référentiel_pour_Sphinx!C:O,13,FALSE),\"\"))),\"\"))","v":""},{"$f":"IF(INDEX(Référentiel_pour_Sphinx!$A$1:$F$235,MATCH(H9,Référentiel_pour_Sphinx!$A$1:$A$235,0),6)=0,\"\",INDEX(Référentiel_pour_Sphinx!$A$1:$F$235,MATCH(H9,Référentiel_pour_Sphinx!$A$1:$A$235,0),6))","v":{"$error":"#N/A"}},{"$f":"IF(D9<>\"\",TEXT(D9,\"mmmm\"),\"\")","v":""},{"$f":"IF(D9<>\"\",YEAR(D9),\"\")","v":""}]
[null,"Prescription N°3",null,null,null,null,null,null,null,null,null,null,{"$f":"IF(H10=\"\",\"\",IF(OR(I10=\"\",J10=\"\",K10=\"\"),\"Saisie Incomplète\",IF(H10=\"\",\"\",\nIF(OR(H10=\"MEDICAMENT NON INTEGRE AU GUIDE DU ResOMeDIT\",K10=\"Hors liste\"),\"Situation non intégrée dans le guide ResOMeDIT\",\nIF(K10=Liste!$B$2,\"Situation non intégrée dans le guide ResOMeDIT\",\nIF(K10=Liste!$B$3,INDEX(Référentiel_pour_Sphinx!$A$1:$U$235,MATCH((H10&I10&\"_\"&J10),Référentiel_pour_Sphinx!$D$1:$D$235,0),17),\nIF(K10=Liste!$B$4,INDEX(Référentiel_pour_Sphinx!$A$1:$U$235,MATCH((H10&I10&\"_\"&J10),Référentiel_pour_Sphinx!$D$1:$D$235,0),18),\nIF(K10=Liste!$B$5,INDEX(Référentiel_pour_Sphinx!$A$1:$U$235,MATCH((H10&I10&\"_\"&J10),Référentiel_pour_Sphinx!$D$1:$D$235,0),19),IF(K10=\"Non Renseigné\",\"Non conformité : Prescription incomplète\",\"Situation non intégrée dans le guide ResOMeDIT\")\n))))))))","v":""},null,null,{"$f":"IF(H10=\"MEDICAMENT NON INTEGRE AU GUIDE DU ResOMeDIT\",\"\",IF(AND(L10<>\"\",L10<>\"Saisie incomplète\"),VLOOKUP(H10&I10,Référentiel_pour_Sphinx!C:G,5,FALSE),\"\"))","v":""},null,{"$f":"IF(H10=\"MEDICAMENT NON INTEGRE AU GUIDE DU ResOMeDIT\",\"\",IF(AND(L10<>\"\",L10<>\"Saisie incomplète\"),IF(K10=\"Gravité\",VLOOKUP(H10&I10,Référentiel_pour_Sphinx!C:O,11,FALSE),IF(K10=\"Diffuseur\",VLOOKUP(H10&I10,Référentiel_pour_Sphinx!C:O,12,FALSE),IF(K10=\"Système Actif Electrique\",VLOOKUP(H10&I10,Référentiel_pour_Sphinx!C:O,13,FALSE),\"\"))),\"\"))","v":""},{"$f":"IF(INDEX(Référentiel_pour_Sphinx!$A$1:$F$235,MATCH(H10,Référentiel_pour_Sphinx!$A$1:$A$235,0),6)=0,\"\",INDEX(Référentiel_pour_Sphinx!$A$1:$F$235,MATCH(H10,Référentiel_pour_Sphinx!$A$1:$A$235,0),6))","v":{"$error":"#N/A"}},"",""]
[null,"Prescription N°4",null,null,null,null,null,null,null,null,null,null,{"$f":"IF(H11=\"\",\"\",IF(OR(I11=\"\",J11=\"\",K11=\"\"),\"Saisie Incomplète\",IF(H11=\"\",\"\",\nIF(OR(H11=\"MEDICAMENT NON INTEGRE AU GUIDE DU ResOMeDIT\",K11=\"Hors liste\"),\"Situation non intégrée dans le guide ResOMeDIT\",\nIF(K11=Liste!$B$2,\"Situation non intégrée dans le guide ResOMeDIT\",\nIF(K11=Liste!$B$3,INDEX(Référentiel_pour_Sphinx!$A$1:$U$235,MATCH((H11&I11&\"_\"&J11),Référentiel_pour_Sphinx!$D$1:$D$235,0),17),\nIF(K11=Liste!$B$4,INDEX(Référentiel_pour_Sphinx!$A$1:$U$235,MATCH((H11&I11&\"_\"&J11),Référentiel_pour_Sphinx!$D$1:$D$235,0),18),\nIF(K11=Liste!$B$5,INDEX(Référentiel_pour_Sphinx!$A$1:$U$235,MATCH((H11&I11&\"_\"&J11),Référentiel_pour_Sphinx!$D$1:$D$235,0),19),IF(K11=\"Non Renseigné\",\"Non conformité : Prescription incomplète\",\"Situation non intégrée dans le guide ResOMeDIT\")\n))))))))","v":""},null,null,{"$f":"IF(H11=\"MEDICAMENT NON INTEGRE AU GUIDE DU ResOMeDIT\",\"\",IF(AND(L11<>\"\",L11<>\"Saisie incomplète\"),VLOOKUP(H11&I11,Référentiel_pour_Sphinx!C:G,5,FALSE),\"\"))","v":""},null,{"$f":"IF(H11=\"MEDICAMENT NON INTEGRE AU GUIDE DU ResOMeDIT\",\"\",IF(AND(L11<>\"\",L11<>\"Saisie incomplète\"),IF(K11=\"Gravité\",VLOOKUP(H11&I11,Référentiel_pour_Sphinx!C:O,11,FALSE),IF(K11=\"Diffuseur\",VLOOKUP(H11&I11,Référentiel_pour_Sphinx!C:O,12,FALSE),IF(K11=\"Système Actif Electrique\",VLOOKUP(H11&I11,Référentiel_pour_Sphinx!C:O,13,FALSE),\"\"))),\"\"))","v":""},{"$f":"IF(INDEX(Référentiel_pour_Sphinx!$A$1:$F$235,MATCH(H11,Référentiel_pour_Sphinx!$A$1:$A$235,0),6)=0,\"\",INDEX(Référentiel_pour_Sphinx!$A$1:$F$235,MATCH(H11,Référentiel_pour_Sphinx!$A$1:$A$235,0),6))","v":{"$error":"#N/A"}},"",""]
[null,"Prescription N°5",null,null,null,null,null,"",null,null,null,null,{"$f":"IF(H12=\"\",\"\",IF(OR(I12=\"\",J12=\"\",K12=\"\"),\"Saisie Incomplète\",IF(H12=\"\",\"\",\nIF(OR(H12=\"MEDICAMENT NON INTEGRE AU GUIDE DU ResOMeDIT\",K12=\"Hors liste\"),\"Situation non intégrée dans le guide ResOMeDIT\",\nIF(K12=Liste!$B$2,\"Situation non intégrée dans le guide ResOMeDIT\",\nIF(K12=Liste!$B$3,INDEX(Référentiel_pour_Sphinx!$A$1:$U$235,MATCH((H12&I12&\"_\"&J12),Référentiel_pour_Sphinx!$D$1:$D$235,0),17),\nIF(K12=Liste!$B$4,INDEX(Référentiel_pour_Sphinx!$A$1:$U$235,MATCH((H12&I12&\"_\"&J12),Référentiel_pour_Sphinx!$D$1:$D$235,0),18),\nIF(K12=Liste!$B$5,INDEX(Référentiel_pour_Sphinx!$A$1:$U$235,MATCH((H12&I12&\"_\"&J12),Référentiel_pour_Sphinx!$D$1:$D$235,0),19),IF(K12=\"Non Renseigné\",\"Non conformité : Prescription incomplète\",\"Situation non intégrée dans le guide ResOMeDIT\")\n))))))))","v":""},null,null,{"$f":"IF(H12=\"MEDICAMENT NON INTEGRE AU GUIDE DU ResOMeDIT\",\"\",IF(AND(L12<>\"\",L12<>\"Saisie incomplète\"),VLOOKUP(H12&I12,Référentiel_pour_Sphinx!C:G,5,FALSE),\"\"))","v":""},null,{"$f":"IF(H12=\"MEDICAMENT NON INTEGRE AU GUIDE DU ResOMeDIT\",\"\",IF(AND(L12<>\"\",L12<>\"Saisie incomplète\"),IF(K12=\"Gravité\",VLOOKUP(H12&I12,Référentiel_pour_Sphinx!C:O,11,FALSE),IF(K12=\"Diffuseur\",VLOOKUP(H12&I12,Référentiel_pour_Sphinx!C:O,12,FALSE),IF(K12=\"Système Actif Electrique\",VLOOKUP(H12&I12,Référentiel_pour_Sphinx!C:O,13,FALSE),\"\"))),\"\"))","v":""},{"$f":"IF(INDEX(Référentiel_pour_Sphinx!$A$1:$F$235,MATCH(H12,Référentiel_pour_Sphinx!$A$1:$A$235,0),6)=0,\"\",INDEX(Référentiel_pour_Sphinx!$A$1:$F$235,MATCH(H12,Référentiel_pour_Sphinx!$A$1:$A$235,0),6))","v":{"$error":"#N/A"}},"",""]
[null,"Prescription N°6",null,null,null,null,null,null,null,null,null,null,{"$f":"IF(H13=\"\",\"\",IF(OR(I13=\"\",J13=\"\",K13=\"\"),\"Saisie Incomplète\",IF(H13=\"\",\"\",\nIF(OR(H13=\"MEDICAMENT NON INTEGRE AU GUIDE DU ResOMeDIT\",K13=\"Hors liste\"),\"Situation non intégrée dans le guide ResOMeDIT\",\nIF(K13=Liste!$B$2,\"Situation non intégrée dans le guide ResOMeDIT\",\nIF(K13=Liste!$B$3,INDEX(Référentiel_pour_Sphinx!$A$1:$U$235,MATCH((H13&I13&\"_\"&J13),Référentiel_pour_Sphinx!$D$1:$D$235,0),17),\nIF(K13=Liste!$B$4,INDEX(Référentiel_pour_Sphinx!$A$1:$U$235,MATCH((H13&I13&\"_\"&J13),Référentiel_pour_Sphinx!$D$1:$D$235,0),18),\nIF(K13=Liste!$B$5,INDEX(Référentiel_pour_Sphinx!$A$1:$U$235,MATCH((H13&I13&\"_\"&J13),Référentiel_pour_Sphinx!$D$1:$D$235,0),19),IF(K13=\"Non Renseigné\",\"Non conformité : Prescription incomplète\",\"Situation non intégrée dans le guide ResOMeDIT\")\n))))))))","v":""},null,null,{"$f":"IF(H13=\"MEDICAMENT NON INTEGRE AU GUIDE DU ResOMeDIT\",\"\",IF(AND(L13<>\"\",L13<>\"Saisie incomplète\"),VLOOKUP(H13&I13,Référentiel_pour_Sphinx!C:G,5,FALSE),\"\"))","v":""},null,{"$f":"IF(H13=\"MEDICAMENT NON INTEGRE AU GUIDE DU ResOMeDIT\",\"\",IF(AND(L13<>\"\",L13<>\"Saisie incomplète\"),IF(K13=\"Gravité\",VLOOKUP(H13&I13,Référentiel_pour_Sphinx!C:O,11,FALSE),IF(K13=\"Diffuseur\",VLOOKUP(H13&I13,Référentiel_pour_Sphinx!C:O,12,FALSE),IF(K13=\"Système Actif Electrique\",VLOOKUP(H13&I13,Référentiel_pour_Sphinx!C:O,13,FALSE),\"\"))),\"\"))","v":""},{"$f":"IF(INDEX(Référentiel_pour_Sphinx!$A$1:$F$235,MATCH(H13,Référentiel_pour_Sphinx!$A$1:$A$235,0),6)=0,\"\",INDEX(Référentiel_pour_Sphinx!$A$1:$F$235,MATCH(H13,Référentiel_pour_Sphinx!$A$1:$A$235,0),6))","v":{"$error":"#N/A"}},"",""]
[null,"Prescription N°7",null,null,null,null,null,null,null,null,null,null,{"$f":"IF(H14=\"\",\"\",IF(OR(I14=\"\",J14=\"\",K14=\"\"),\"Saisie Incomplète\",IF(H14=\"\",\"\",\nIF(OR(H14=\"MEDICAMENT NON INTEGRE AU GUIDE DU ResOMeDIT\",K14=\"Hors liste\"),\"Situation non intégrée dans le guide ResOMeDIT\",\nIF(K14=Liste!$B$2,\"Situation non intégrée dans le guide ResOMeDIT\",\nIF(K14=Liste!$B$3,INDEX(Référentiel_pour_Sphinx!$A$1:$U$235,MATCH((H14&I14&\"_\"&J14),Référentiel_pour_Sphinx!$D$1:$D$235,0),17),\nIF(K14=Liste!$B$4,INDEX(Référentiel_pour_Sphinx!$A$1:$U$235,MATCH((H14&I14&\"_\"&J14),Référentiel_pour_Sphinx!$D$1:$D$235,0),18),\nIF(K14=Liste!$B$5,INDEX(Référentiel_pour_Sphinx!$A$1:$U$235,MATCH((H14&I14&\"_\"&J14),Référentiel_pour_Sphinx!$D$1:$D$235,0),19),IF(K14=\"Non Renseigné\",\"Non conformité : Prescription incomplète\",\"Situation non intégrée dans le guide ResOMeDIT\")\n))))))))","v":""},null,null,{"$f":"IF(H14=\"MEDICAMENT NON INTEGRE AU GUIDE DU ResOMeDIT\",\"\",IF(AND(L14<>\"\",L14<>\"Saisie incomplète\"),VLOOKUP(H14&I14,Référentiel_pour_Sphinx!C:G,5,FALSE),\"\"))","v":""},null,{"$f":"IF(H14=\"MEDICAMENT NON INTEGRE AU GUIDE DU ResOMeDIT\",\"\",IF(AND(L14<>\"\",L14<>\"Saisie incomplète\"),IF(K14=\"Gravité\",VLOOKUP(H14&I14,Référentiel_pour_Sphinx!C:O,11,FALSE),IF(K14=\"Diffuseur\",VLOOKUP(H14&I14,Référentiel_pour_Sphinx!C:O,12,FALSE),IF(K14=\"Système Actif Electrique\",VLOOKUP(H14&I14,Référentiel_pour_Sphinx!C:O,13,FALSE),\"\"))),\"\"))","v":""},{"$f":"IF(INDEX(Référentiel_pour_Sphinx!$A$1:$F$235,MATCH(H14,Référentiel_pour_Sphinx!$A$1:$A$235,0),6)=0,\"\",INDEX(Référentiel_pour_Sphinx!$A$1:$F$235,MATCH(H14,Référentiel_pour_Sphinx!$A$1:$A$235,0),6))","v":{"$error":"#N/A"}},"",""]
[null,"Prescription N°8",null,null,null,null,null,null,null,null,null,null,{"$f":"IF(H15=\"\",\"\",IF(OR(I15=\"\",J15=\"\",K15=\"\"),\"Saisie Incomplète\",IF(H15=\"\",\"\",\nIF(OR(H15=\"MEDICAMENT NON INTEGRE AU GUIDE DU ResOMeDIT\",K15=\"Hors liste\"),\"Situation non intégrée dans le guide ResOMeDIT\",\nIF(K15=Liste!$B$2,\"Situation non intégrée dans le guide ResOMeDIT\",\nIF(K15=Liste!$B$3,INDEX(Référentiel_pour_Sphinx!$A$1:$U$235,MATCH((H15&I15&\"_\"&J15),Référentiel_pour_Sphinx!$D$1:$D$235,0),17),\nIF(K15=Liste!$B$4,INDEX(Référentiel_pour_Sphinx!$A$1:$U$235,MATCH((H15&I15&\"_\"&J15),Référentiel_pour_Sphinx!$D$1:$D$235,0),18),\nIF(K15=Liste!$B$5,INDEX(Référentiel_pour_Sphinx!$A$1:$U$235,MATCH((H15&I15&\"_\"&J15),Référentiel_pour_Sphinx!$D$1:$D$235,0),19),IF(K15=\"Non Renseigné\",\"Non conformité : Prescription incomplète\",\"Situation non intégrée dans le guide ResOMeDIT\")\n))))))))","v":""},null,null,{"$f":"IF(H15=\"MEDICAMENT NON INTEGRE AU GUIDE DU ResOMeDIT\",\"\",IF(AND(L15<>\"\",L15<>\"Saisie incomplète\"),VLOOKUP(H15&I15,Référentiel_pour_Sphinx!C:G,5,FALSE),\"\"))","v":""},null,{"$f":"IF(H15=\"MEDICAMENT NON INTEGRE AU GUIDE DU ResOMeDIT\",\"\",IF(AND(L15<>\"\",L15<>\"Saisie incomplète\"),IF(K15=\"Gravité\",VLOOKUP(H15&I15,Référentiel_pour_Sphinx!C:O,11,FALSE),IF(K15=\"Diffuseur\",VLOOKUP(H15&I15,Référentiel_pour_Sphinx!C:O,12,FALSE),IF(K15=\"Système Actif Electrique\",VLOOKUP(H15&I15,Référentiel_pour_Sphinx!C:O,13,FALSE),\"\"))),\"\"))","v":""},{"$f":"IF(INDEX(Référentiel_pour_Sphinx!$A$1:$F$235,MATCH(H15,Référentiel_pour_Sphinx!$A$1:$A$235,0),6)=0,\"\",INDEX(Référentiel_pour_Sphinx!$A$1:$F$235,MATCH(H15,Référentiel_pour_Sphinx!$A$1:$A$235,0),6))","v":{"$error":"#N/A"}},"",""]
[null,"Prescription N°9",null,null,null,null,null,null,null,null,null,null,{"$f":"IF(H16=\"\",\"\",IF(OR(I16=\"\",J16=\"\",K16=\"\"),\"Saisie Incomplète\",IF(H16=\"\",\"\",\nIF(OR(H16=\"MEDICAMENT NON INTEGRE AU GUIDE DU ResOMeDIT\",K16=\"Hors liste\"),\"Situation non intégrée dans le guide ResOMeDIT\",\nIF(K16=Liste!$B$2,\"Situation non intégrée dans le guide ResOMeDIT\",\nIF(K16=Liste!$B$3,INDEX(Référentiel_pour_Sphinx!$A$1:$U$235,MATCH((H16&I16&\"_\"&J16),Référentiel_pour_Sphinx!$D$1:$D$235,0),17),\nIF(K16=Liste!$B$4,INDEX(Référentiel_pour_Sphinx!$A$1:$U$235,MATCH((H16&I16&\"_\"&J16),Référentiel_pour_Sphinx!$D$1:$D$235,0),18),\nIF(K16=Liste!$B$5,INDEX(Référentiel_pour_Sphinx!$A$1:$U$235,MATCH((H16&I16&\"_\"&J16),Référentiel_pour_Sphinx!$D$1:$D$235,0),19),IF(K16=\"Non Renseigné\",\"Non conformité : Prescription incomplète\",\"Situation non intégrée dans le guide ResOMeDIT\")\n))))))))","v":""},null,null,{"$f":"IF(H16=\"MEDICAMENT NON INTEGRE AU GUIDE DU ResOMeDIT\",\"\",IF(AND(L16<>\"\",L16<>\"Saisie incomplète\"),VLOOKUP(H16&I16,Référentiel_pour_Sphinx!C:G,5,FALSE),\"\"))","v":""},null,{"$f":"IF(H16=\"MEDICAMENT NON INTEGRE AU GUIDE DU ResOMeDIT\",\"\",IF(AND(L16<>\"\",L16<>\"Saisie incomplète\"),IF(K16=\"Gravité\",VLOOKUP(H16&I16,Référentiel_pour_Sphinx!C:O,11,FALSE),IF(K16=\"Diffuseur\",VLOOKUP(H16&I16,Référentiel_pour_Sphinx!C:O,12,FALSE),IF(K16=\"Système Actif Electrique\",VLOOKUP(H16&I16,Référentiel_pour_Sphinx!C:O,13,FALSE),\"\"))),\"\"))","v":""},{"$f":"IF(INDEX(Référentiel_pour_Sphinx!$A$1:$F$235,MATCH(H16,Référentiel_pour_Sphinx!$A$1:$A$235,0),6)=0,\"\",INDEX(Référentiel_pour_Sphinx!$A$1:$F$235,MATCH(H16,Référentiel_pour_Sphinx!$A$1:$A$235,0),6))","v":{"$error":"#N/A"}},"",""]
[null,"Prescription N°10",null,null,null,null,null,null,null,null,null,null,{"$f":"IF(H17=\"\",\"\",IF(OR(I17=\"\",J17=\"\",K17=\"\"),\"Saisie Incomplète\",IF(H17=\"\",\"\",\nIF(OR(H17=\"MEDICAMENT NON INTEGRE AU GUIDE DU ResOMeDIT\",K17=\"Hors liste\"),\"Situation non intégrée dans le guide ResOMeDIT\",\nIF(K17=Liste!$B$2,\"Situation non intégrée dans le guide ResOMeDIT\",\nIF(K17=Liste!$B$3,INDEX(Référentiel_pour_Sphinx!$A$1:$U$235,MATCH((H17&I17&\"_\"&J17),Référentiel_pour_Sphinx!$D$1:$D$235,0),17),\nIF(K17=Liste!$B$4,INDEX(Référentiel_pour_Sphinx!$A$1:$U$235,MATCH((H17&I17&\"_\"&J17),Référentiel_pour_Sphinx!$D$1:$D$235,0),18),\nIF(K17=Liste!$B$5,INDEX(Référentiel_pour_Sphinx!$A$1:$U$235,MATCH((H17&I17&\"_\"&J17),Référentiel_pour_Sphinx!$D$1:$D$235,0),19),IF(K17=\"Non Renseigné\",\"Non conformité : Prescription incomplète\",\"Situation non intégrée dans le guide ResOMeDIT\")\n))))))))","v":""},null,null,{"$f":"IF(H17=\"MEDICAMENT NON INTEGRE AU GUIDE DU ResOMeDIT\",\"\",IF(AND(L17<>\"\",L17<>\"Saisie incomplète\"),VLOOKUP(H17&I17,Référentiel_pour_Sphinx!C:G,5,FALSE),\"\"))","v":""},null,{"$f":"IF(H17=\"MEDICAMENT NON INTEGRE AU GUIDE DU ResOMeDIT\",\"\",IF(AND(L17<>\"\",L17<>\"Saisie incomplète\"),IF(K17=\"Gravité\",VLOOKUP(H17&I17,Référentiel_pour_Sphinx!C:O,11,FALSE),IF(K17=\"Diffuseur\",VLOOKUP(H17&I17,Référentiel_pour_Sphinx!C:O,12,FALSE),IF(K17=\"Système Actif Electrique\",VLOOKUP(H17&I17,Référentiel_pour_Sphinx!C:O,13,FALSE),\"\"))),\"\"))","v":""},{"$f":"IF(INDEX(Référentiel_pour_Sphinx!$A$1:$F$235,MATCH(H17,Référentiel_pour_Sphinx!$A$1:$A$235,0),6)=0,\"\",INDEX(Référentiel_pour_Sphinx!$A$1:$F$235,MATCH(H17,Référentiel_pour_Sphinx!$A$1:$A$235,0),6))","v":{"$error":"#N/A"}},"",""]
[null,"Prescription N°11",null,null,null,null,null,"",null,null,null,null,{"$f":"IF(H18=\"\",\"\",IF(OR(I18=\"\",J18=\"\",K18=\"\"),\"Saisie Incomplète\",IF(H18=\"\",\"\",\nIF(OR(H18=\"MEDICAMENT NON INTEGRE AU GUIDE DU ResOMeDIT\",K18=\"Hors liste\"),\"Situation non intégrée dans le guide ResOMeDIT\",\nIF(K18=Liste!$B$2,\"Situation non intégrée dans le guide ResOMeDIT\",\nIF(K18=Liste!$B$3,INDEX(Référentiel_pour_Sphinx!$A$1:$U$235,MATCH((H18&I18&\"_\"&J18),Référentiel_pour_Sphinx!$D$1:$D$235,0),17),\nIF(K18=Liste!$B$4,INDEX(Référentiel_pour_Sphinx!$A$1:$U$235,MATCH((H18&I18&\"_\"&J18),Référentiel_pour_Sphinx!$D$1:$D$235,0),18),\nIF(K18=Liste!$B$5,INDEX(Référentiel_pour_Sphinx!$A$1:$U$235,MATCH((H18&I18&\"_\"&J18),Référentiel_pour_Sphinx!$D$1:$D$235,0),19),IF(K18=\"Non Renseigné\",\"Non conformité : Prescription incomplète\",\"Situation non intégrée dans le guide ResOMeDIT\")\n))))))))","v":""},null,null,{"$f":"IF(H18=\"MEDICAMENT NON INTEGRE AU GUIDE DU ResOMeDIT\",\"\",IF(AND(L18<>\"\",L18<>\"Saisie incomplète\"),VLOOKUP(H18&I18,Référentiel_pour_Sphinx!C:G,5,FALSE),\"\"))","v":""},null,{"$f":"IF(H18=\"MEDICAMENT NON INTEGRE AU GUIDE DU ResOMeDIT\",\"\",IF(AND(L18<>\"\",L18<>\"Saisie incomplète\"),IF(K18=\"Gravité\",VLOOKUP(H18&I18,Référentiel_pour_Sphinx!C:O,11,FALSE),IF(K18=\"Diffuseur\",VLOOKUP(H18&I18,Référentiel_pour_Sphinx!C:O,12,FALSE),IF(K18=\"Système Actif Electrique\",VLOOKUP(H18&I18,Référentiel_pour_Sphinx!C:O,13,FALSE),\"\"))),\"\"))","v":""},{"$f":"IF(INDEX(Référentiel_pour_Sphinx!$A$1:$F$235,MATCH(H18,Référentiel_pour_Sphinx!$A$1:$A$235,0),6)=0,\"\",INDEX(Référentiel_pour_Sphinx!$A$1:$F$235,MATCH(H18,Référentiel_pour_Sphinx!$A$1:$A$235,0),6))","v":{"$error":"#N/A"}},"",""]
[null,"Prescription N°12",null,null,null,null,null,null,null,null,null,null,{"$f":"IF(H19=\"\",\"\",IF(OR(I19=\"\",J19=\"\",K19=\"\"),\"Saisie Incomplète\",IF(H19=\"\",\"\",\nIF(OR(H19=\"MEDICAMENT NON INTEGRE AU GUIDE DU ResOMeDIT\",K19=\"Hors liste\"),\"Situation non intégrée dans le guide ResOMeDIT\",\nIF(K19=Liste!$B$2,\"Situation non intégrée dans le guide ResOMeDIT\",\nIF(K19=Liste!$B$3,INDEX(Référentiel_pour_Sphinx!$A$1:$U$235,MATCH((H19&I19&\"_\"&J19),Référentiel_pour_Sphinx!$D$1:$D$235,0),17),\nIF(K19=Liste!$B$4,INDEX(Référentiel_pour_Sphinx!$A$1:$U$235,MATCH((H19&I19&\"_\"&J19),Référentiel_pour_Sphinx!$D$1:$D$235,0),18),\nIF(K19=Liste!$B$5,INDEX(Référentiel_pour_Sphinx!$A$1:$U$235,MATCH((H19&I19&\"_\"&J19),Référentiel_pour_Sphinx!$D$1:$D$235,0),19),IF(K19=\"Non Renseigné\",\"Non conformité : Prescription incomplète\",\"Situation non intégrée dans le guide ResOMeDIT\")\n))))))))","v":""},null,null,{"$f":"IF(H19=\"MEDICAMENT NON INTEGRE AU GUIDE DU ResOMeDIT\",\"\",IF(AND(L19<>\"\",L19<>\"Saisie incomplète\"),VLOOKUP(H19&I19,Référentiel_pour_Sphinx!C:G,5,FALSE),\"\"))","v":""},null,{"$f":"IF(H19=\"MEDICAMENT NON INTEGRE AU GUIDE DU ResOMeDIT\",\"\",IF(AND(L19<>\"\",L19<>\"Saisie incomplète\"),IF(K19=\"Gravité\",VLOOKUP(H19&I19,Référentiel_pour_Sphinx!C:O,11,FALSE),IF(K19=\"Diffuseur\",VLOOKUP(H19&I19,Référentiel_pour_Sphinx!C:O,12,FALSE),IF(K19=\"Système Actif Electrique\",VLOOKUP(H19&I19,Référentiel_pour_Sphinx!C:O,13,FALSE),\"\"))),\"\"))","v":""},{"$f":"IF(INDEX(Référentiel_pour_Sphinx!$A$1:$F$235,MATCH(H19,Référentiel_pour_Sphinx!$A$1:$A$235,0),6)=0,\"\",INDEX(Référentiel_pour_Sphinx!$A$1:$F$235,MATCH(H19,Référentiel_pour_Sphinx!$A$1:$A$235,0),6))","v":{"$error":"#N/A"}},"",""]
[null,"Prescription N°13",null,null,null,null,null,null,null,null,null,null,{"$f":"IF(H20=\"\",\"\",IF(OR(I20=\"\",J20=\"\",K20=\"\"),\"Saisie Incomplète\",IF(H20=\"\",\"\",\nIF(OR(H20=\"MEDICAMENT NON INTEGRE AU GUIDE DU ResOMeDIT\",K20=\"Hors liste\"),\"Situation non intégrée dans le guide ResOMeDIT\",\nIF(K20=Liste!$B$2,\"Situation non intégrée dans le guide ResOMeDIT\",\nIF(K20=Liste!$B$3,INDEX(Référentiel_pour_Sphinx!$A$1:$U$235,MATCH((H20&I20&\"_\"&J20),Référentiel_pour_Sphinx!$D$1:$D$235,0),17),\nIF(K20=Liste!$B$4,INDEX(Référentiel_pour_Sphinx!$A$1:$U$235,MATCH((H20&I20&\"_\"&J20),Référentiel_pour_Sphinx!$D$1:$D$235,0),18),\nIF(K20=Liste!$B$5,INDEX(Référentiel_pour_Sphinx!$A$1:$U$235,MATCH((H20&I20&\"_\"&J20),Référentiel_pour_Sphinx!$D$1:$D$235,0),19),IF(K20=\"Non Renseigné\",\"Non conformité : Prescription incomplète\",\"Situation non intégrée dans le guide ResOMeDIT\")\n))))))))","v":""},null,null,{"$f":"IF(H20=\"MEDICAMENT NON INTEGRE AU GUIDE DU ResOMeDIT\",\"\",IF(AND(L20<>\"\",L20<>\"Saisie incomplète\"),VLOOKUP(H20&I20,Référentiel_pour_Sphinx!C:G,5,FALSE),\"\"))","v":""},null,{"$f":"IF(H20=\"MEDICAMENT NON INTEGRE AU GUIDE DU ResOMeDIT\",\"\",IF(AND(L20<>\"\",L20<>\"Saisie incomplète\"),IF(K20=\"Gravité\",VLOOKUP(H20&I20,Référentiel_pour_Sphinx!C:O,11,FALSE),IF(K20=\"Diffuseur\",VLOOKUP(H20&I20,Référentiel_pour_Sphinx!C:O,12,FALSE),IF(K20=\"Système Actif Electrique\",VLOOKUP(H20&I20,Référentiel_pour_Sphinx!C:O,13,FALSE),\"\"))),\"\"))","v":""},{"$f":"IF(INDEX(Référentiel_pour_Sphinx!$A$1:$F$235,MATCH(H20,Référentiel_pour_Sphinx!$A$1:$A$235,0),6)=0,\"\",INDEX(Référentiel_pour_Sphinx!$A$1:$F$235,MATCH(H20,Référentiel_pour_Sphinx!$A$1:$A$235,0),6))","v":{"$error":"#N/A"}},"",""]
[null,"Prescription N°14",null,null,null,null,null,"",null,null,null,null,{"$f":"IF(H21=\"\",\"\",IF(OR(I21=\"\",J21=\"\",K21=\"\"),\"Saisie Incomplète\",IF(H21=\"\",\"\",\nIF(OR(H21=\"MEDICAMENT NON INTEGRE AU GUIDE DU ResOMeDIT\",K21=\"Hors liste\"),\"Situation non intégrée dans le guide ResOMeDIT\",\nIF(K21=Liste!$B$2,\"Situation non intégrée dans le guide ResOMeDIT\",\nIF(K21=Liste!$B$3,INDEX(Référentiel_pour_Sphinx!$A$1:$U$235,MATCH((H21&I21&\"_\"&J21),Référentiel_pour_Sphinx!$D$1:$D$235,0),17),\nIF(K21=Liste!$B$4,INDEX(Référentiel_pour_Sphinx!$A$1:$U$235,MATCH((H21&I21&\"_\"&J21),Référentiel_pour_Sphinx!$D$1:$D$235,0),18),\nIF(K21=Liste!$B$5,INDEX(Référentiel_pour_Sphinx!$A$1:$U$235,MATCH((H21&I21&\"_\"&J21),Référentiel_pour_Sphinx!$D$1:$D$235,0),19),IF(K21=\"Non Renseigné\",\"Non conformité : Prescription incomplète\",\"Situation non intégrée dans le guide ResOMeDIT\")\n))))))))","v":""},null,null,{"$f":"IF(H21=\"MEDICAMENT NON INTEGRE AU GUIDE DU ResOMeDIT\",\"\",IF(AND(L21<>\"\",L21<>\"Saisie incomplète\"),VLOOKUP(H21&I21,Référentiel_pour_Sphinx!C:G,5,FALSE),\"\"))","v":""},null,{"$f":"IF(H21=\"MEDICAMENT NON INTEGRE AU GUIDE DU ResOMeDIT\",\"\",IF(AND(L21<>\"\",L21<>\"Saisie incomplète\"),IF(K21=\"Gravité\",VLOOKUP(H21&I21,Référentiel_pour_Sphinx!C:O,11,FALSE),IF(K21=\"Diffuseur\",VLOOKUP(H21&I21,Référentiel_pour_Sphinx!C:O,12,FALSE),IF(K21=\"Système Actif Electrique\",VLOOKUP(H21&I21,Référentiel_pour_Sphinx!C:O,13,FALSE),\"\"))),\"\"))","v":""},{"$f":"IF(INDEX(Référentiel_pour_Sphinx!$A$1:$F$235,MATCH(H21,Référentiel_pour_Sphinx!$A$1:$A$235,0),6)=0,\"\",INDEX(Référentiel_pour_Sphinx!$A$1:$F$235,MATCH(H21,Référentiel_pour_Sphinx!$A$1:$A$235,0),6))","v":{"$error":"#N/A"}},"",""]
[null,"Prescription N°15",null,null,null,null,null,null,null,null,null,null,{"$f":"IF(H22=\"\",\"\",IF(OR(I22=\"\",J22=\"\",K22=\"\"),\"Saisie Incomplète\",IF(H22=\"\",\"\",\nIF(OR(H22=\"MEDICAMENT NON INTEGRE AU GUIDE DU ResOMeDIT\",K22=\"Hors liste\"),\"Situation non intégrée dans le guide ResOMeDIT\",\nIF(K22=Liste!$B$2,\"Situation non intégrée dans le guide ResOMeDIT\",\nIF(K22=Liste!$B$3,INDEX(Référentiel_pour_Sphinx!$A$1:$U$235,MATCH((H22&I22&\"_\"&J22),Référentiel_pour_Sphinx!$D$1:$D$235,0),17),\nIF(K22=Liste!$B$4,INDEX(Référentiel_pour_Sphinx!$A$1:$U$235,MATCH((H22&I22&\"_\"&J22),Référentiel_pour_Sphinx!$D$1:$D$235,0),18),\nIF(K22=Liste!$B$5,INDEX(Référentiel_pour_Sphinx!$A$1:$U$235,MATCH((H22&I22&\"_\"&J22),Référentiel_pour_Sphinx!$D$1:$D$235,0),19),IF(K22=\"Non Renseigné\",\"Non conformité : Prescription incomplète\",\"Situation non intégrée dans le guide ResOMeDIT\")\n))))))))","v":""},null,null,{"$f":"IF(H22=\"MEDICAMENT NON INTEGRE AU GUIDE DU ResOMeDIT\",\"\",IF(AND(L22<>\"\",L22<>\"Saisie incomplète\"),VLOOKUP(H22&I22,Référentiel_pour_Sphinx!C:G,5,FALSE),\"\"))","v":""},null,{"$f":"IF(H22=\"MEDICAMENT NON INTEGRE AU GUIDE DU ResOMeDIT\",\"\",IF(AND(L22<>\"\",L22<>\"Saisie incomplète\"),IF(K22=\"Gravité\",VLOOKUP(H22&I22,Référentiel_pour_Sphinx!C:O,11,FALSE),IF(K22=\"Diffuseur\",VLOOKUP(H22&I22,Référentiel_pour_Sphinx!C:O,12,FALSE),IF(K22=\"Système Actif Electrique\",VLOOKUP(H22&I22,Référentiel_pour_Sphinx!C:O,13,FALSE),\"\"))),\"\"))","v":""},{"$f":"IF(INDEX(Référentiel_pour_Sphinx!$A$1:$F$235,MATCH(H22,Référentiel_pour_Sphinx!$A$1:$A$235,0),6)=0,\"\",INDEX(Référentiel_pour_Sphinx!$A$1:$F$235,MATCH(H22,Référentiel_pour_Sphinx!$A$1:$A$235,0),6))","v":{"$error":"#N/A"}},"",""]
[null,"Prescription N°16",null,null,null,null,null,null,null,null,null,null,{"$f":"IF(H23=\"\",\"\",IF(OR(I23=\"\",J23=\"\",K23=\"\"),\"Saisie Incomplète\",IF(H23=\"\",\"\",\nIF(OR(H23=\"MEDICAMENT NON INTEGRE AU GUIDE DU ResOMeDIT\",K23=\"Hors liste\"),\"Situation non intégrée dans le guide ResOMeDIT\",\nIF(K23=Liste!$B$2,\"Situation non intégrée dans le guide ResOMeDIT\",\nIF(K23=Liste!$B$3,INDEX(Référentiel_pour_Sphinx!$A$1:$U$235,MATCH((H23&I23&\"_\"&J23),Référentiel_pour_Sphinx!$D$1:$D$235,0),17),\nIF(K23=Liste!$B$4,INDEX(Référentiel_pour_Sphinx!$A$1:$U$235,MATCH((H23&I23&\"_\"&J23),Référentiel_pour_Sphinx!$D$1:$D$235,0),18),\nIF(K23=Liste!$B$5,INDEX(Référentiel_pour_Sphinx!$A$1:$U$235,MATCH((H23&I23&\"_\"&J23),Référentiel_pour_Sphinx!$D$1:$D$235,0),19),IF(K23=\"Non Renseigné\",\"Non conformité : Prescription incomplète\",\"Situation non intégrée dans le guide ResOMeDIT\")\n))))))))","v":""},null,null,{"$f":"IF(H23=\"MEDICAMENT NON INTEGRE AU GUIDE DU ResOMeDIT\",\"\",IF(AND(L23<>\"\",L23<>\"Saisie incomplète\"),VLOOKUP(H23&I23,Référentiel_pour_Sphinx!C:G,5,FALSE),\"\"))","v":""},null,{"$f":"IF(H23=\"MEDICAMENT NON INTEGRE AU GUIDE DU ResOMeDIT\",\"\",IF(AND(L23<>\"\",L23<>\"Saisie incomplète\"),IF(K23=\"Gravité\",VLOOKUP(H23&I23,Référentiel_pour_Sphinx!C:O,11,FALSE),IF(K23=\"Diffuseur\",VLOOKUP(H23&I23,Référentiel_pour_Sphinx!C:O,12,FALSE),IF(K23=\"Système Actif Electrique\",VLOOKUP(H23&I23,Référentiel_pour_Sphinx!C:O,13,FALSE),\"\"))),\"\"))","v":""},{"$f":"IF(INDEX(Référentiel_pour_Sphinx!$A$1:$F$235,MATCH(H23,Référentiel_pour_Sphinx!$A$1:$A$235,0),6)=0,\"\",INDEX(Référentiel_pour_Sphinx!$A$1:$F$235,MATCH(H23,Référentiel_pour_Sphinx!$A$1:$A$235,0),6))","v":{"$error":"#N/A"}},"",""]
[null,"Prescription N°17",null,null,null,null,null,null,null,null,null,null,{"$f":"IF(H24=\"\",\"\",IF(OR(I24=\"\",J24=\"\",K24=\"\"),\"Saisie Incomplète\",IF(H24=\"\",\"\",\nIF(OR(H24=\"MEDICAMENT NON INTEGRE AU GUIDE DU ResOMeDIT\",K24=\"Hors liste\"),\"Situation non intégrée dans le guide ResOMeDIT\",\nIF(K24=Liste!$B$2,\"Situation non intégrée dans le guide ResOMeDIT\",\nIF(K24=Liste!$B$3,INDEX(Référentiel_pour_Sphinx!$A$1:$U$235,MATCH((H24&I24&\"_\"&J24),Référentiel_pour_Sphinx!$D$1:$D$235,0),17),\nIF(K24=Liste!$B$4,INDEX(Référentiel_pour_Sphinx!$A$1:$U$235,MATCH((H24&I24&\"_\"&J24),Référentiel_pour_Sphinx!$D$1:$D$235,0),18),\nIF(K24=Liste!$B$5,INDEX(Référentiel_pour_Sphinx!$A$1:$U$235,MATCH((H24&I24&\"_\"&J24),Référentiel_pour_Sphinx!$D$1:$D$235,0),19),IF(K24=\"Non Renseigné\",\"Non conformité : Prescription incomplète\",\"Situation non intégrée dans le guide ResOMeDIT\")\n))))))))","v":""},null,null,{"$f":"IF(H24=\"MEDICAMENT NON INTEGRE AU GUIDE DU ResOMeDIT\",\"\",IF(AND(L24<>\"\",L24<>\"Saisie incomplète\"),VLOOKUP(H24&I24,Référentiel_pour_Sphinx!C:G,5,FALSE),\"\"))","v":""},null,{"$f":"IF(H24=\"MEDICAMENT NON INTEGRE AU GUIDE DU ResOMeDIT\",\"\",IF(AND(L24<>\"\",L24<>\"Saisie incomplète\"),IF(K24=\"Gravité\",VLOOKUP(H24&I24,Référentiel_pour_Sphinx!C:O,11,FALSE),IF(K24=\"Diffuseur\",VLOOKUP(H24&I24,Référentiel_pour_Sphinx!C:O,12,FALSE),IF(K24=\"Système Actif Electrique\",VLOOKUP(H24&I24,Référentiel_pour_Sphinx!C:O,13,FALSE),\"\"))),\"\"))","v":""},{"$f":"IF(INDEX(Référentiel_pour_Sphinx!$A$1:$F$235,MATCH(H24,Référentiel_pour_Sphinx!$A$1:$A$235,0),6)=0,\"\",INDEX(Référentiel_pour_Sphinx!$A$1:$F$235,MATCH(H24,Référentiel_pour_Sphinx!$A$1:$A$235,0),6))","v":{"$error":"#N/A"}},"",""]
[null,"Prescription N°18",null,null,null,null,null,null,null,null,null,null,{"$f":"IF(H25=\"\",\"\",IF(OR(I25=\"\",J25=\"\",K25=\"\"),\"Saisie Incomplète\",IF(H25=\"\",\"\",\nIF(OR(H25=\"MEDICAMENT NON INTEGRE AU GUIDE DU ResOMeDIT\",K25=\"Hors liste\"),\"Situation non intégrée dans le guide ResOMeDIT\",\nIF(K25=Liste!$B$2,\"Situation non intégrée dans le guide ResOMeDIT\",\nIF(K25=Liste!$B$3,INDEX(Référentiel_pour_Sphinx!$A$1:$U$235,MATCH((H25&I25&\"_\"&J25),Référentiel_pour_Sphinx!$D$1:$D$235,0),17),\nIF(K25=Liste!$B$4,INDEX(Référentiel_pour_Sphinx!$A$1:$U$235,MATCH((H25&I25&\"_\"&J25),Référentiel_pour_Sphinx!$D$1:$D$235,0),18),\nIF(K25=Liste!$B$5,INDEX(Référentiel_pour_Sphinx!$A$1:$U$235,MATCH((H25&I25&\"_\"&J25),Référentiel_pour_Sphinx!$D$1:$D$235,0),19),IF(K25=\"Non Renseigné\",\"Non conformité : Prescription incomplète\",\"Situation non intégrée dans le guide ResOMeDIT\")\n))))))))","v":""},null,null,{"$f":"IF(H25=\"MEDICAMENT NON INTEGRE AU GUIDE DU ResOMeDIT\",\"\",IF(AND(L25<>\"\",L25<>\"Saisie incomplète\"),VLOOKUP(H25&I25,Référentiel_pour_Sphinx!C:G,5,FALSE),\"\"))","v":""},null,{"$f":"IF(H25=\"MEDICAMENT NON INTEGRE AU GUIDE DU ResOMeDIT\",\"\",IF(AND(L25<>\"\",L25<>\"Saisie incomplète\"),IF(K25=\"Gravité\",VLOOKUP(H25&I25,Référentiel_pour_Sphinx!C:O,11,FALSE),IF(K25=\"Diffuseur\",VLOOKUP(H25&I25,Référentiel_pour_Sphinx!C:O,12,FALSE),IF(K25=\"Système Actif Electrique\",VLOOKUP(H25&I25,Référentiel_pour_Sphinx!C:O,13,FALSE),\"\"))),\"\"))","v":""},{"$f":"IF(INDEX(Référentiel_pour_Sphinx!$A$1:$F$235,MATCH(H25,Référentiel_pour_Sphinx!$A$1:$A$235,0),6)=0,\"\",INDEX(Référentiel_pour_Sphinx!$A$1:$F$235,MATCH(H25,Référentiel_pour_Sphinx!$A$1:$A$235,0),6))","v":{"$error":"#N/A"}},"",""]
[null,"Prescription N°19",null,null,null,null,null,null,null,null,null,null,{"$f":"IF(H26=\"\",\"\",IF(OR(I26=\"\",J26=\"\",K26=\"\"),\"Saisie Incomplète\",IF(H26=\"\",\"\",\nIF(OR(H26=\"MEDICAMENT NON INTEGRE AU GUIDE DU ResOMeDIT\",K26=\"Hors liste\"),\"Situation non intégrée dans le guide ResOMeDIT\",\nIF(K26=Liste!$B$2,\"Situation non intégrée dans le guide ResOMeDIT\",\nIF(K26=Liste!$B$3,INDEX(Référentiel_pour_Sphinx!$A$1:$U$235,MATCH((H26&I26&\"_\"&J26),Référentiel_pour_Sphinx!$D$1:$D$235,0),17),\nIF(K26=Liste!$B$4,INDEX(Référentiel_pour_Sphinx!$A$1:$U$235,MATCH((H26&I26&\"_\"&J26),Référentiel_pour_Sphinx!$D$1:$D$235,0),18),\nIF(K26=Liste!$B$5,INDEX(Référentiel_pour_Sphinx!$A$1:$U$235,MATCH((H26&I26&\"_\"&J26),Référentiel_pour_Sphinx!$D$1:$D$235,0),19),IF(K26=\"Non Renseigné\",\"Non conformité : Prescription incomplète\",\"Situation non intégrée dans le guide ResOMeDIT\")\n))))))))","v":""},null,null,{"$f":"IF(H26=\"MEDICAMENT NON INTEGRE AU GUIDE DU ResOMeDIT\",\"\",IF(AND(L26<>\"\",L26<>\"Saisie incomplète\"),VLOOKUP(H26&I26,Référentiel_pour_Sphinx!C:G,5,FALSE),\"\"))","v":""},null,{"$f":"IF(H26=\"MEDICAMENT NON INTEGRE AU GUIDE DU ResOMeDIT\",\"\",IF(AND(L26<>\"\",L26<>\"Saisie incomplète\"),IF(K26=\"Gravité\",VLOOKUP(H26&I26,Référentiel_pour_Sphinx!C:O,11,FALSE),IF(K26=\"Diffuseur\",VLOOKUP(H26&I26,Référentiel_pour_Sphinx!C:O,12,FALSE),IF(K26=\"Système Actif Electrique\",VLOOKUP(H26&I26,Référentiel_pour_Sphinx!C:O,13,FALSE),\"\"))),\"\"))","v":""},{"$f":"IF(INDEX(Référentiel_pour_Sphinx!$A$1:$F$235,MATCH(H26,Référentiel_pour_Sphinx!$A$1:$A$235,0),6)=0,\"\",INDEX(Référentiel_pour_Sphinx!$A$1:$F$235,MATCH(H26,Référentiel_pour_Sphinx!$A$1:$A$235,0),6))","v":{"$error":"#N/A"}},"",""]
[null,"Prescription N°20",null,null,null,null,null,null,null,null,null,null,{"$f":"IF(H27=\"\",\"\",IF(OR(I27=\"\",J27=\"\",K27=\"\"),\"Saisie Incomplète\",IF(H27=\"\",\"\",\nIF(OR(H27=\"MEDICAMENT NON INTEGRE AU GUIDE DU ResOMeDIT\",K27=\"Hors liste\"),\"Situation non intégrée dans le guide ResOMeDIT\",\nIF(K27=Liste!$B$2,\"Situation non intégrée dans le guide ResOMeDIT\",\nIF(K27=Liste!$B$3,INDEX(Référentiel_pour_Sphinx!$A$1:$U$235,MATCH((H27&I27&\"_\"&J27),Référentiel_pour_Sphinx!$D$1:$D$235,0),17),\nIF(K27=Liste!$B$4,INDEX(Référentiel_pour_Sphinx!$A$1:$U$235,MATCH((H27&I27&\"_\"&J27),Référentiel_pour_Sphinx!$D$1:$D$235,0),18),\nIF(K27=Liste!$B$5,INDEX(Référentiel_pour_Sphinx!$A$1:$U$235,MATCH((H27&I27&\"_\"&J27),Référentiel_pour_Sphinx!$D$1:$D$235,0),19),IF(K27=\"Non Renseigné\",\"Non conformité : Prescription incomplète\",\"Situation non intégrée dans le guide ResOMeDIT\")\n))))))))","v":""},null,null,{"$f":"IF(H27=\"MEDICAMENT NON INTEGRE AU GUIDE DU ResOMeDIT\",\"\",IF(AND(L27<>\"\",L27<>\"Saisie incomplète\"),VLOOKUP(H27&I27,Référentiel_pour_Sphinx!C:G,5,FALSE),\"\"))","v":""},null,{"$f":"IF(H27=\"MEDICAMENT NON INTEGRE AU GUIDE DU ResOMeDIT\",\"\",IF(AND(L27<>\"\",L27<>\"Saisie incomplète\"),IF(K27=\"Gravité\",VLOOKUP(H27&I27,Référentiel_pour_Sphinx!C:O,11,FALSE),IF(K27=\"Diffuseur\",VLOOKUP(H27&I27,Référentiel_pour_Sphinx!C:O,12,FALSE),IF(K27=\"Système Actif Electrique\",VLOOKUP(H27&I27,Référentiel_pour_Sphinx!C:O,13,FALSE),\"\"))),\"\"))","v":""},{"$f":"IF(INDEX(Référentiel_pour_Sphinx!$A$1:$F$235,MATCH(H27,Référentiel_pour_Sphinx!$A$1:$A$235,0),6)=0,\"\",INDEX(Référentiel_pour_Sphinx!$A$1:$F$235,MATCH(H27,Référentiel_pour_Sphinx!$A$1:$A$235,0),6))","v":{"$error":"#N/A"}},"",""]
[null,"Prescription N°21",null,null,null,null,null,null,null,null,null,null,{"$f":"IF(H28=\"\",\"\",IF(OR(I28=\"\",J28=\"\",K28=\"\"),\"Saisie Incomplète\",IF(H28=\"\",\"\",\nIF(OR(H28=\"MEDICAMENT NON INTEGRE AU GUIDE DU ResOMeDIT\",K28=\"Hors liste\"),\"Situation non intégrée dans le guide ResOMeDIT\",\nIF(K28=Liste!$B$2,\"Situation non intégrée dans le guide ResOMeDIT\",\nIF(K28=Liste!$B$3,INDEX(Référentiel_pour_Sphinx!$A$1:$U$235,MATCH((H28&I28&\"_\"&J28),Référentiel_pour_Sphinx!$D$1:$D$235,0),17),\nIF(K28=Liste!$B$4,INDEX(Référentiel_pour_Sphinx!$A$1:$U$235,MATCH((H28&I28&\"_\"&J28),Référentiel_pour_Sphinx!$D$1:$D$235,0),18),\nIF(K28=Liste!$B$5,INDEX(Référentiel_pour_Sphinx!$A$1:$U$235,MATCH((H28&I28&\"_\"&J28),Référentiel_pour_Sphinx!$D$1:$D$235,0),19),IF(K28=\"Non Renseigné\",\"Non conformité : Prescription incomplète\",\"Situation non intégrée dans le guide ResOMeDIT\")\n))))))))","v":""},null,null,{"$f":"IF(H28=\"MEDICAMENT NON INTEGRE AU GUIDE DU ResOMeDIT\",\"\",IF(AND(L28<>\"\",L28<>\"Saisie incomplète\"),VLOOKUP(H28&I28,Référentiel_pour_Sphinx!C:G,5,FALSE),\"\"))","v":""},null,{"$f":"IF(H28=\"MEDICAMENT NON INTEGRE AU GUIDE DU ResOMeDIT\",\"\",IF(AND(L28<>\"\",L28<>\"Saisie incomplète\"),IF(K28=\"Gravité\",VLOOKUP(H28&I28,Référentiel_pour_Sphinx!C:O,11,FALSE),IF(K28=\"Diffuseur\",VLOOKUP(H28&I28,Référentiel_pour_Sphinx!C:O,12,FALSE),IF(K28=\"Système Actif Electrique\",VLOOKUP(H28&I28,Référentiel_pour_Sphinx!C:O,13,FALSE),\"\"))),\"\"))","v":""},{"$f":"IF(INDEX(Référentiel_pour_Sphinx!$A$1:$F$235,MATCH(H28,Référentiel_pour_Sphinx!$A$1:$A$235,0),6)=0,\"\",INDEX(Référentiel_pour_Sphinx!$A$1:$F$235,MATCH(H28,Référentiel_pour_Sphinx!$A$1:$A$235,0),6))","v":{"$error":"#N/A"}},"",""]
[null,"Prescription N°22",null,null,null,null,null,null,null,null,null,null,{"$f":"IF(H29=\"\",\"\",IF(OR(I29=\"\",J29=\"\",K29=\"\"),\"Saisie Incomplète\",IF(H29=\"\",\"\",\nIF(OR(H29=\"MEDICAMENT NON INTEGRE AU GUIDE DU ResOMeDIT\",K29=\"Hors liste\"),\"Situation non intégrée dans le guide ResOMeDIT\",\nIF(K29=Liste!$B$2,\"Situation non intégrée dans le guide ResOMeDIT\",\nIF(K29=Liste!$B$3,INDEX(Référentiel_pour_Sphinx!$A$1:$U$235,MATCH((H29&I29&\"_\"&J29),Référentiel_pour_Sphinx!$D$1:$D$235,0),17),\nIF(K29=Liste!$B$4,INDEX(Référentiel_pour_Sphinx!$A$1:$U$235,MATCH((H29&I29&\"_\"&J29),Référentiel_pour_Sphinx!$D$1:$D$235,0),18),\nIF(K29=Liste!$B$5,INDEX(Référentiel_pour_Sphinx!$A$1:$U$235,MATCH((H29&I29&\"_\"&J29),Référentiel_pour_Sphinx!$D$1:$D$235,0),19),IF(K29=\"Non Renseigné\",\"Non conformité : Prescription incomplète\",\"Situation non intégrée dans le guide ResOMeDIT\")\n))))))))","v":""},null,null,{"$f":"IF(H29=\"MEDICAMENT NON INTEGRE AU GUIDE DU ResOMeDIT\",\"\",IF(AND(L29<>\"\",L29<>\"Saisie incomplète\"),VLOOKUP(H29&I29,Référentiel_pour_Sphinx!C:G,5,FALSE),\"\"))","v":""},null,{"$f":"IF(H29=\"MEDICAMENT NON INTEGRE AU GUIDE DU ResOMeDIT\",\"\",IF(AND(L29<>\"\",L29<>\"Saisie incomplète\"),IF(K29=\"Gravité\",VLOOKUP(H29&I29,Référentiel_pour_Sphinx!C:O,11,FALSE),IF(K29=\"Diffuseur\",VLOOKUP(H29&I29,Référentiel_pour_Sphinx!C:O,12,FALSE),IF(K29=\"Système Actif Electrique\",VLOOKUP(H29&I29,Référentiel_pour_Sphinx!C:O,13,FALSE),\"\"))),\"\"))","v":""},{"$f":"IF(INDEX(Référentiel_pour_Sphinx!$A$1:$F$235,MATCH(H29,Référentiel_pour_Sphinx!$A$1:$A$235,0),6)=0,\"\",INDEX(Référentiel_pour_Sphinx!$A$1:$F$235,MATCH(H29,Référentiel_pour_Sphinx!$A$1:$A$235,0),6))","v":{"$error":"#N/A"}},"",""]
[null,"Prescription N°23",null,null,null,null,null,null,null,null,null,null,{"$f":"IF(H30=\"\",\"\",IF(OR(I30=\"\",J30=\"\",K30=\"\"),\"Saisie Incomplète\",IF(H30=\"\",\"\",\nIF(OR(H30=\"MEDICAMENT NON INTEGRE AU GUIDE DU ResOMeDIT\",K30=\"Hors liste\"),\"Situation non intégrée dans le guide ResOMeDIT\",\nIF(K30=Liste!$B$2,\"Situation non intégrée dans le guide ResOMeDIT\",\nIF(K30=Liste!$B$3,INDEX(Référentiel_pour_Sphinx!$A$1:$U$235,MATCH((H30&I30&\"_\"&J30),Référentiel_pour_Sphinx!$D$1:$D$235,0),17),\nIF(K30=Liste!$B$4,INDEX(Référentiel_pour_Sphinx!$A$1:$U$235,MATCH((H30&I30&\"_\"&J30),Référentiel_pour_Sphinx!$D$1:$D$235,0),18),\nIF(K30=Liste!$B$5,INDEX(Référentiel_pour_Sphinx!$A$1:$U$235,MATCH((H30&I30&\"_\"&J30),Référentiel_pour_Sphinx!$D$1:$D$235,0),19),IF(K30=\"Non Renseigné\",\"Non conformité : Prescription incomplète\",\"Situation non intégrée dans le guide ResOMeDIT\")\n))))))))","v":""},null,null,{"$f":"IF(H30=\"MEDICAMENT NON INTEGRE AU GUIDE DU ResOMeDIT\",\"\",IF(AND(L30<>\"\",L30<>\"Saisie incomplète\"),VLOOKUP(H30&I30,Référentiel_pour_Sphinx!C:G,5,FALSE),\"\"))","v":""},null,{"$f":"IF(H30=\"MEDICAMENT NON INTEGRE AU GUIDE DU ResOMeDIT\",\"\",IF(AND(L30<>\"\",L30<>\"Saisie incomplète\"),IF(K30=\"Gravité\",VLOOKUP(H30&I30,Référentiel_pour_Sphinx!C:O,11,FALSE),IF(K30=\"Diffuseur\",VLOOKUP(H30&I30,Référentiel_pour_Sphinx!C:O,12,FALSE),IF(K30=\"Système Actif Electrique\",VLOOKUP(H30&I30,Référentiel_pour_Sphinx!C:O,13,FALSE),\"\"))),\"\"))","v":""},{"$f":"IF(INDEX(Référentiel_pour_Sphinx!$A$1:$F$235,MATCH(H30,Référentiel_pour_Sphinx!$A$1:$A$235,0),6)=0,\"\",INDEX(Référentiel_pour_Sphinx!$A$1:$F$235,MATCH(H30,Référentiel_pour_Sphinx!$A$1:$A$235,0),6))","v":{"$error":"#N/A"}},"",""]
[null,"Prescription N°24",null,null,null,null,null,null,null,null,null,null,{"$f":"IF(H31=\"\",\"\",IF(OR(I31=\"\",J31=\"\",K31=\"\"),\"Saisie Incomplète\",IF(H31=\"\",\"\",\nIF(OR(H31=\"MEDICAMENT NON INTEGRE AU GUIDE DU ResOMeDIT\",K31=\"Hors liste\"),\"Situation non intégrée dans le guide ResOMeDIT\",\nIF(K31=Liste!$B$2,\"Situation non intégrée dans le guide ResOMeDIT\",\nIF(K31=Liste!$B$3,INDEX(Référentiel_pour_Sphinx!$A$1:$U$235,MATCH((H31&I31&\"_\"&J31),Référentiel_pour_Sphinx!$D$1:$D$235,0),17),\nIF(K31=Liste!$B$4,INDEX(Référentiel_pour_Sphinx!$A$1:$U$235,MATCH((H31&I31&\"_\"&J31),Référentiel_pour_Sphinx!$D$1:$D$235,0),18),\nIF(K31=Liste!$B$5,INDEX(Référentiel_pour_Sphinx!$A$1:$U$235,MATCH((H31&I31&\"_\"&J31),Référentiel_pour_Sphinx!$D$1:$D$235,0),19),IF(K31=\"Non Renseigné\",\"Non conformité : Prescription incomplète\",\"Situation non intégrée dans le guide ResOMeDIT\")\n))))))))","v":""},null,null,{"$f":"IF(H31=\"MEDICAMENT NON INTEGRE AU GUIDE DU ResOMeDIT\",\"\",IF(AND(L31<>\"\",L31<>\"Saisie incomplète\"),VLOOKUP(H31&I31,Référentiel_pour_Sphinx!C:G,5,FALSE),\"\"))","v":""},null,{"$f":"IF(H31=\"MEDICAMENT NON INTEGRE AU GUIDE DU ResOMeDIT\",\"\",IF(AND(L31<>\"\",L31<>\"Saisie incomplète\"),IF(K31=\"Gravité\",VLOOKUP(H31&I31,Référentiel_pour_Sphinx!C:O,11,FALSE),IF(K31=\"Diffuseur\",VLOOKUP(H31&I31,Référentiel_pour_Sphinx!C:O,12,FALSE),IF(K31=\"Système Actif Electrique\",VLOOKUP(H31&I31,Référentiel_pour_Sphinx!C:O,13,FALSE),\"\"))),\"\"))","v":""},{"$f":"IF(INDEX(Référentiel_pour_Sphinx!$A$1:$F$235,MATCH(H31,Référentiel_pour_Sphinx!$A$1:$A$235,0),6)=0,\"\",INDEX(Référentiel_pour_Sphinx!$A$1:$F$235,MATCH(H31,Référentiel_pour_Sphinx!$A$1:$A$235,0),6))","v":{"$error":"#N/A"}},"",""]
[null,"Prescription N°25",null,null,null,null,null,null,null,null,null,null,{"$f":"IF(H32=\"\",\"\",IF(OR(I32=\"\",J32=\"\",K32=\"\"),\"Saisie Incomplète\",IF(H32=\"\",\"\",\nIF(OR(H32=\"MEDICAMENT NON INTEGRE AU GUIDE DU ResOMeDIT\",K32=\"Hors liste\"),\"Situation non intégrée dans le guide ResOMeDIT\",\nIF(K32=Liste!$B$2,\"Situation non intégrée dans le guide ResOMeDIT\",\nIF(K32=Liste!$B$3,INDEX(Référentiel_pour_Sphinx!$A$1:$U$235,MATCH((H32&I32&\"_\"&J32),Référentiel_pour_Sphinx!$D$1:$D$235,0),17),\nIF(K32=Liste!$B$4,INDEX(Référentiel_pour_Sphinx!$A$1:$U$235,MATCH((H32&I32&\"_\"&J32),Référentiel_pour_Sphinx!$D$1:$D$235,0),18),\nIF(K32=Liste!$B$5,INDEX(Référentiel_pour_Sphinx!$A$1:$U$235,MATCH((H32&I32&\"_\"&J32),Référentiel_pour_Sphinx!$D$1:$D$235,0),19),IF(K32=\"Non Renseigné\",\"Non conformité : Prescription incomplète\",\"Situation non intégrée dans le guide ResOMeDIT\")\n))))))))","v":""},null,null,{"$f":"IF(H32=\"MEDICAMENT NON INTEGRE AU GUIDE DU ResOMeDIT\",\"\",IF(AND(L32<>\"\",L32<>\"Saisie incomplète\"),VLOOKUP(H32&I32,Référentiel_pour_Sphinx!C:G,5,FALSE),\"\"))","v":""},null,{"$f":"IF(H32=\"MEDICAMENT NON INTEGRE AU GUIDE DU ResOMeDIT\",\"\",IF(AND(L32<>\"\",L32<>\"Saisie incomplète\"),IF(K32=\"Gravité\",VLOOKUP(H32&I32,Référentiel_pour_Sphinx!C:O,11,FALSE),IF(K32=\"Diffuseur\",VLOOKUP(H32&I32,Référentiel_pour_Sphinx!C:O,12,FALSE),IF(K32=\"Système Actif Electrique\",VLOOKUP(H32&I32,Référentiel_pour_Sphinx!C:O,13,FALSE),\"\"))),\"\"))","v":""},{"$f":"IF(INDEX(Référentiel_pour_Sphinx!$A$1:$F$235,MATCH(H32,Référentiel_pour_Sphinx!$A$1:$A$235,0),6)=0,\"\",INDEX(Référentiel_pour_Sphinx!$A$1:$F$235,MATCH(H32,Référentiel_pour_Sphinx!$A$1:$A$235,0),6))","v":{"$error":"#N/A"}},"",""]
[null,"Prescription N°26",null,null,null,null,null,null,null,null,null,null,{"$f":"IF(H33=\"\",\"\",IF(OR(I33=\"\",J33=\"\",K33=\"\"),\"Saisie Incomplète\",IF(H33=\"\",\"\",\nIF(OR(H33=\"MEDICAMENT NON INTEGRE AU GUIDE DU ResOMeDIT\",K33=\"Hors liste\"),\"Situation non intégrée dans le guide ResOMeDIT\",\nIF(K33=Liste!$B$2,\"Situation non intégrée dans le guide ResOMeDIT\",\nIF(K33=Liste!$B$3,INDEX(Référentiel_pour_Sphinx!$A$1:$U$235,MATCH((H33&I33&\"_\"&J33),Référentiel_pour_Sphinx!$D$1:$D$235,0),17),\nIF(K33=Liste!$B$4,INDEX(Référentiel_pour_Sphinx!$A$1:$U$235,MATCH((H33&I33&\"_\"&J33),Référentiel_pour_Sphinx!$D$1:$D$235,0),18),\nIF(K33=Liste!$B$5,INDEX(Référentiel_pour_Sphinx!$A$1:$U$235,MATCH((H33&I33&\"_\"&J33),Référentiel_pour_Sphinx!$D$1:$D$235,0),19),IF(K33=\"Non Renseigné\",\"Non conformité : Prescription incomplète\",\"Situation non intégrée dans le guide ResOMeDIT\")\n))))))))","v":""},null,null,{"$f":"IF(H33=\"MEDICAMENT NON INTEGRE AU GUIDE DU ResOMeDIT\",\"\",IF(AND(L33<>\"\",L33<>\"Saisie incomplète\"),VLOOKUP(H33&I33,Référentiel_pour_Sphinx!C:G,5,FALSE),\"\"))","v":""},null,{"$f":"IF(H33=\"MEDICAMENT NON INTEGRE AU GUIDE DU ResOMeDIT\",\"\",IF(AND(L33<>\"\",L33<>\"Saisie incomplète\"),IF(K33=\"Gravité\",VLOOKUP(H33&I33,Référentiel_pour_Sphinx!C:O,11,FALSE),IF(K33=\"Diffuseur\",VLOOKUP(H33&I33,Référentiel_pour_Sphinx!C:O,12,FALSE),IF(K33=\"Système Actif Electrique\",VLOOKUP(H33&I33,Référentiel_pour_Sphinx!C:O,13,FALSE),\"\"))),\"\"))","v":""},{"$f":"IF(INDEX(Référentiel_pour_Sphinx!$A$1:$F$235,MATCH(H33,Référentiel_pour_Sphinx!$A$1:$A$235,0),6)=0,\"\",INDEX(Référentiel_pour_Sphinx!$A$1:$F$235,MATCH(H33,Référentiel_pour_Sphinx!$A$1:$A$235,0),6))","v":{"$error":"#N/A"}},"",""]
[null,"Prescription N°27",null,null,null,null,null,null,null,null,null,null,{"$f":"IF(H34=\"\",\"\",IF(OR(I34=\"\",J34=\"\",K34=\"\"),\"Saisie Incomplète\",IF(H34=\"\",\"\",\nIF(OR(H34=\"MEDICAMENT NON INTEGRE AU GUIDE DU ResOMeDIT\",K34=\"Hors liste\"),\"Situation non intégrée dans le guide ResOMeDIT\",\nIF(K34=Liste!$B$2,\"Situation non intégrée dans le guide ResOMeDIT\",\nIF(K34=Liste!$B$3,INDEX(Référentiel_pour_Sphinx!$A$1:$U$235,MATCH((H34&I34&\"_\"&J34),Référentiel_pour_Sphinx!$D$1:$D$235,0),17),\nIF(K34=Liste!$B$4,INDEX(Référentiel_pour_Sphinx!$A$1:$U$235,MATCH((H34&I34&\"_\"&J34),Référentiel_pour_Sphinx!$D$1:$D$235,0),18),\nIF(K34=Liste!$B$5,INDEX(Référentiel_pour_Sphinx!$A$1:$U$235,MATCH((H34&I34&\"_\"&J34),Référentiel_pour_Sphinx!$D$1:$D$235,0),19),IF(K34=\"Non Renseigné\",\"Non conformité : Prescription incomplète\",\"Situation non intégrée dans le guide ResOMeDIT\")\n))))))))","v":""},null,null,{"$f":"IF(H34=\"MEDICAMENT NON INTEGRE AU GUIDE DU ResOMeDIT\",\"\",IF(AND(L34<>\"\",L34<>\"Saisie incomplète\"),VLOOKUP(H34&I34,Référentiel_pour_Sphinx!C:G,5,FALSE),\"\"))","v":""},null,{"$f":"IF(H34=\"MEDICAMENT NON INTEGRE AU GUIDE DU ResOMeDIT\",\"\",IF(AND(L34<>\"\",L34<>\"Saisie incomplète\"),IF(K34=\"Gravité\",VLOOKUP(H34&I34,Référentiel_pour_Sphinx!C:O,11,FALSE),IF(K34=\"Diffuseur\",VLOOKUP(H34&I34,Référentiel_pour_Sphinx!C:O,12,FALSE),IF(K34=\"Système Actif Electrique\",VLOOKUP(H34&I34,Référentiel_pour_Sphinx!C:O,13,FALSE),\"\"))),\"\"))","v":""},{"$f":"IF(INDEX(Référentiel_pour_Sphinx!$A$1:$F$235,MATCH(H34,Référentiel_pour_Sphinx!$A$1:$A$235,0),6)=0,\"\",INDEX(Référentiel_pour_Sphinx!$A$1:$F$235,MATCH(H34,Référentiel_pour_Sphinx!$A$1:$A$235,0),6))","v":{"$error":"#N/A"}},"",""]
[null,"Prescription N°28",null,null,null,null,null,null,null,null,null,null,{"$f":"IF(H35=\"\",\"\",IF(OR(I35=\"\",J35=\"\",K35=\"\"),\"Saisie Incomplète\",IF(H35=\"\",\"\",\nIF(OR(H35=\"MEDICAMENT NON INTEGRE AU GUIDE DU ResOMeDIT\",K35=\"Hors liste\"),\"Situation non intégrée dans le guide ResOMeDIT\",\nIF(K35=Liste!$B$2,\"Situation non intégrée dans le guide ResOMeDIT\",\nIF(K35=Liste!$B$3,INDEX(Référentiel_pour_Sphinx!$A$1:$U$235,MATCH((H35&I35&\"_\"&J35),Référentiel_pour_Sphinx!$D$1:$D$235,0),17),\nIF(K35=Liste!$B$4,INDEX(Référentiel_pour_Sphinx!$A$1:$U$235,MATCH((H35&I35&\"_\"&J35),Référentiel_pour_Sphinx!$D$1:$D$235,0),18),\nIF(K35=Liste!$B$5,INDEX(Référentiel_pour_Sphinx!$A$1:$U$235,MATCH((H35&I35&\"_\"&J35),Référentiel_pour_Sphinx!$D$1:$D$235,0),19),IF(K35=\"Non Renseigné\",\"Non conformité : Prescription incomplète\",\"Situation non intégrée dans le guide ResOMeDIT\")\n))))))))","v":""},null,null,{"$f":"IF(H35=\"MEDICAMENT NON INTEGRE AU GUIDE DU ResOMeDIT\",\"\",IF(AND(L35<>\"\",L35<>\"Saisie incomplète\"),VLOOKUP(H35&I35,Référentiel_pour_Sphinx!C:G,5,FALSE),\"\"))","v":""},null,{"$f":"IF(H35=\"MEDICAMENT NON INTEGRE AU GUIDE DU ResOMeDIT\",\"\",IF(AND(L35<>\"\",L35<>\"Saisie incomplète\"),IF(K35=\"Gravité\",VLOOKUP(H35&I35,Référentiel_pour_Sphinx!C:O,11,FALSE),IF(K35=\"Diffuseur\",VLOOKUP(H35&I35,Référentiel_pour_Sphinx!C:O,12,FALSE),IF(K35=\"Système Actif Electrique\",VLOOKUP(H35&I35,Référentiel_pour_Sphinx!C:O,13,FALSE),\"\"))),\"\"))","v":""},{"$f":"IF(INDEX(Référentiel_pour_Sphinx!$A$1:$F$235,MATCH(H35,Référentiel_pour_Sphinx!$A$1:$A$235,0),6)=0,\"\",INDEX(Référentiel_pour_Sphinx!$A$1:$F$235,MATCH(H35,Référentiel_pour_Sphinx!$A$1:$A$235,0),6))","v":{"$error":"#N/A"}},"",""]
[null,"Prescription N°29",null,null,null,null,null,null,null,null,null,null,{"$f":"IF(H36=\"\",\"\",IF(OR(I36=\"\",J36=\"\",K36=\"\"),\"Saisie Incomplète\",IF(H36=\"\",\"\",\nIF(OR(H36=\"MEDICAMENT NON INTEGRE AU GUIDE DU ResOMeDIT\",K36=\"Hors liste\"),\"Situation non intégrée dans le guide ResOMeDIT\",\nIF(K36=Liste!$B$2,\"Situation non intégrée dans le guide ResOMeDIT\",\nIF(K36=Liste!$B$3,INDEX(Référentiel_pour_Sphinx!$A$1:$U$235,MATCH((H36&I36&\"_\"&J36),Référentiel_pour_Sphinx!$D$1:$D$235,0),17),\nIF(K36=Liste!$B$4,INDEX(Référentiel_pour_Sphinx!$A$1:$U$235,MATCH((H36&I36&\"_\"&J36),Référentiel_pour_Sphinx!$D$1:$D$235,0),18),\nIF(K36=Liste!$B$5,INDEX(Référentiel_pour_Sphinx!$A$1:$U$235,MATCH((H36&I36&\"_\"&J36),Référentiel_pour_Sphinx!$D$1:$D$235,0),19),IF(K36=\"Non Renseigné\",\"Non conformité : Prescription incomplète\",\"Situation non intégrée dans le guide ResOMeDIT\")\n))))))))","v":""},null,null,{"$f":"IF(H36=\"MEDICAMENT NON INTEGRE AU GUIDE DU ResOMeDIT\",\"\",IF(AND(L36<>\"\",L36<>\"Saisie incomplète\"),VLOOKUP(H36&I36,Référentiel_pour_Sphinx!C:G,5,FALSE),\"\"))","v":""},null,{"$f":"IF(H36=\"MEDICAMENT NON INTEGRE AU GUIDE DU ResOMeDIT\",\"\",IF(AND(L36<>\"\",L36<>\"Saisie incomplète\"),IF(K36=\"Gravité\",VLOOKUP(H36&I36,Référentiel_pour_Sphinx!C:O,11,FALSE),IF(K36=\"Diffuseur\",VLOOKUP(H36&I36,Référentiel_pour_Sphinx!C:O,12,FALSE),IF(K36=\"Système Actif Electrique\",VLOOKUP(H36&I36,Référentiel_pour_Sphinx!C:O,13,FALSE),\"\"))),\"\"))","v":""},{"$f":"IF(INDEX(Référentiel_pour_Sphinx!$A$1:$F$235,MATCH(H36,Référentiel_pour_Sphinx!$A$1:$A$235,0),6)=0,\"\",INDEX(Référentiel_pour_Sphinx!$A$1:$F$235,MATCH(H36,Référentiel_pour_Sphinx!$A$1:$A$235,0),6))","v":{"$error":"#N/A"}},"",""]
[null,"Prescription N°30",null,null,null,null,null,null,null,null,null,null,{"$f":"IF(H37=\"\",\"\",IF(OR(I37=\"\",J37=\"\",K37=\"\"),\"Saisie Incomplète\",IF(H37=\"\",\"\",\nIF(OR(H37=\"MEDICAMENT NON INTEGRE AU GUIDE DU ResOMeDIT\",K37=\"Hors liste\"),\"Situation non intégrée dans le guide ResOMeDIT\",\nIF(K37=Liste!$B$2,\"Situation non intégrée dans le guide ResOMeDIT\",\nIF(K37=Liste!$B$3,INDEX(Référentiel_pour_Sphinx!$A$1:$U$235,MATCH((H37&I37&\"_\"&J37),Référentiel_pour_Sphinx!$D$1:$D$235,0),17),\nIF(K37=Liste!$B$4,INDEX(Référentiel_pour_Sphinx!$A$1:$U$235,MATCH((H37&I37&\"_\"&J37),Référentiel_pour_Sphinx!$D$1:$D$235,0),18),\nIF(K37=Liste!$B$5,INDEX(Référentiel_pour_Sphinx!$A$1:$U$235,MATCH((H37&I37&\"_\"&J37),Référentiel_pour_Sphinx!$D$1:$D$235,0),19),IF(K37=\"Non Renseigné\",\"Non conformité : Prescription incomplète\",\"Situation non intégrée dans le guide ResOMeDIT\")\n))))))))","v":""},null,null,{"$f":"IF(H37=\"MEDICAMENT NON INTEGRE AU GUIDE DU ResOMeDIT\",\"\",IF(AND(L37<>\"\",L37<>\"Saisie incomplète\"),VLOOKUP(H37&I37,Référentiel_pour_Sphinx!C:G,5,FALSE),\"\"))","v":""},null,{"$f":"IF(H37=\"MEDICAMENT NON INTEGRE AU GUIDE DU ResOMeDIT\",\"\",IF(AND(L37<>\"\",L37<>\"Saisie incomplète\"),IF(K37=\"Gravité\",VLOOKUP(H37&I37,Référentiel_pour_Sphinx!C:O,11,FALSE),IF(K37=\"Diffuseur\",VLOOKUP(H37&I37,Référentiel_pour_Sphinx!C:O,12,FALSE),IF(K37=\"Système Actif Electrique\",VLOOKUP(H37&I37,Référentiel_pour_Sphinx!C:O,13,FALSE),\"\"))),\"\"))","v":""},{"$f":"IF(INDEX(Référentiel_pour_Sphinx!$A$1:$F$235,MATCH(H37,Référentiel_pour_Sphinx!$A$1:$A$235,0),6)=0,\"\",INDEX(Référentiel_pour_Sphinx!$A$1:$F$235,MATCH(H37,Référentiel_pour_Sphinx!$A$1:$A$235,0),6))","v":{"$error":"#N/A"}},"",""]
[null,"Prescription N°31",null,null,null,null,null,null,null,null,null,null,{"$f":"IF(H38=\"\",\"\",IF(OR(I38=\"\",J38=\"\",K38=\"\"),\"Saisie Incomplète\",IF(H38=\"\",\"\",\nIF(OR(H38=\"MEDICAMENT NON INTEGRE AU GUIDE DU ResOMeDIT\",K38=\"Hors liste\"),\"Situation non intégrée dans le guide ResOMeDIT\",\nIF(K38=Liste!$B$2,\"Situation non intégrée dans le guide ResOMeDIT\",\nIF(K38=Liste!$B$3,INDEX(Référentiel_pour_Sphinx!$A$1:$U$235,MATCH((H38&I38&\"_\"&J38),Référentiel_pour_Sphinx!$D$1:$D$235,0),17),\nIF(K38=Liste!$B$4,INDEX(Référentiel_pour_Sphinx!$A$1:$U$235,MATCH((H38&I38&\"_\"&J38),Référentiel_pour_Sphinx!$D$1:$D$235,0),18),\nIF(K38=Liste!$B$5,INDEX(Référentiel_pour_Sphinx!$A$1:$U$235,MATCH((H38&I38&\"_\"&J38),Référentiel_pour_Sphinx!$D$1:$D$235,0),19),IF(K38=\"Non Renseigné\",\"Non conformité : Prescription incomplète\",\"Situation non intégrée dans le guide ResOMeDIT\")\n))))))))","v":""},null,null,{"$f":"IF(H38=\"MEDICAMENT NON INTEGRE AU GUIDE DU ResOMeDIT\",\"\",IF(AND(L38<>\"\",L38<>\"Saisie incomplète\"),VLOOKUP(H38&I38,Référentiel_pour_Sphinx!C:G,5,FALSE),\"\"))","v":""},null,{"$f":"IF(H38=\"MEDICAMENT NON INTEGRE AU GUIDE DU ResOMeDIT\",\"\",IF(AND(L38<>\"\",L38<>\"Saisie incomplète\"),IF(K38=\"Gravité\",VLOOKUP(H38&I38,Référentiel_pour_Sphinx!C:O,11,FALSE),IF(K38=\"Diffuseur\",VLOOKUP(H38&I38,Référentiel_pour_Sphinx!C:O,12,FALSE),IF(K38=\"Système Actif Electrique\",VLOOKUP(H38&I38,Référentiel_pour_Sphinx!C:O,13,FALSE),\"\"))),\"\"))","v":""},{"$f":"IF(INDEX(Référentiel_pour_Sphinx!$A$1:$F$235,MATCH(H38,Référentiel_pour_Sphinx!$A$1:$A$235,0),6)=0,\"\",INDEX(Référentiel_pour_Sphinx!$A$1:$F$235,MATCH(H38,Référentiel_pour_Sphinx!$A$1:$A$235,0),6))","v":{"$error":"#N/A"}},"",""]
[null,"Prescription N°32",null,null,null,null,null,null,null,null,null,null,{"$f":"IF(H39=\"\",\"\",IF(OR(I39=\"\",J39=\"\",K39=\"\"),\"Saisie Incomplète\",IF(H39=\"\",\"\",\nIF(OR(H39=\"MEDICAMENT NON INTEGRE AU GUIDE DU ResOMeDIT\",K39=\"Hors liste\"),\"Situation non intégrée dans le guide ResOMeDIT\",\nIF(K39=Liste!$B$2,\"Situation non intégrée dans le guide ResOMeDIT\",\nIF(K39=Liste!$B$3,INDEX(Référentiel_pour_Sphinx!$A$1:$U$235,MATCH((H39&I39&\"_\"&J39),Référentiel_pour_Sphinx!$D$1:$D$235,0),17),\nIF(K39=Liste!$B$4,INDEX(Référentiel_pour_Sphinx!$A$1:$U$235,MATCH((H39&I39&\"_\"&J39),Référentiel_pour_Sphinx!$D$1:$D$235,0),18),\nIF(K39=Liste!$B$5,INDEX(Référentiel_pour_Sphinx!$A$1:$U$235,MATCH((H39&I39&\"_\"&J39),Référentiel_pour_Sphinx!$D$1:$D$235,0),19),IF(K39=\"Non Renseigné\",\"Non conformité : Prescription incomplète\",\"Situation non intégrée dans le guide ResOMeDIT\")\n))))))))","v":""},null,null,{"$f":"IF(H39=\"MEDICAMENT NON INTEGRE AU GUIDE DU ResOMeDIT\",\"\",IF(AND(L39<>\"\",L39<>\"Saisie incomplète\"),VLOOKUP(H39&I39,Référentiel_pour_Sphinx!C:G,5,FALSE),\"\"))","v":""},null,{"$f":"IF(H39=\"MEDICAMENT NON INTEGRE AU GUIDE DU ResOMeDIT\",\"\",IF(AND(L39<>\"\",L39<>\"Saisie incomplète\"),IF(K39=\"Gravité\",VLOOKUP(H39&I39,Référentiel_pour_Sphinx!C:O,11,FALSE),IF(K39=\"Diffuseur\",VLOOKUP(H39&I39,Référentiel_pour_Sphinx!C:O,12,FALSE),IF(K39=\"Système Actif Electrique\",VLOOKUP(H39&I39,Référentiel_pour_Sphinx!C:O,13,FALSE),\"\"))),\"\"))","v":""},{"$f":"IF(INDEX(Référentiel_pour_Sphinx!$A$1:$F$235,MATCH(H39,Référentiel_pour_Sphinx!$A$1:$A$235,0),6)=0,\"\",INDEX(Référentiel_pour_Sphinx!$A$1:$F$235,MATCH(H39,Référentiel_pour_Sphinx!$A$1:$A$235,0),6))","v":{"$error":"#N/A"}},"",""]
[null,"Prescription N°33",null,null,null,null,null,null,null,null,null,null,{"$f":"IF(H40=\"\",\"\",IF(OR(I40=\"\",J40=\"\",K40=\"\"),\"Saisie Incomplète\",IF(H40=\"\",\"\",\nIF(OR(H40=\"MEDICAMENT NON INTEGRE AU GUIDE DU ResOMeDIT\",K40=\"Hors liste\"),\"Situation non intégrée dans le guide ResOMeDIT\",\nIF(K40=Liste!$B$2,\"Situation non intégrée dans le guide ResOMeDIT\",\nIF(K40=Liste!$B$3,INDEX(Référentiel_pour_Sphinx!$A$1:$U$235,MATCH((H40&I40&\"_\"&J40),Référentiel_pour_Sphinx!$D$1:$D$235,0),17),\nIF(K40=Liste!$B$4,INDEX(Référentiel_pour_Sphinx!$A$1:$U$235,MATCH((H40&I40&\"_\"&J40),Référentiel_pour_Sphinx!$D$1:$D$235,0),18),\nIF(K40=Liste!$B$5,INDEX(Référentiel_pour_Sphinx!$A$1:$U$235,MATCH((H40&I40&\"_\"&J40),Référentiel_pour_Sphinx!$D$1:$D$235,0),19),IF(K40=\"Non Renseigné\",\"Non conformité : Prescription incomplète\",\"Situation non intégrée dans le guide ResOMeDIT\")\n))))))))","v":""},null,null,{"$f":"IF(H40=\"MEDICAMENT NON INTEGRE AU GUIDE DU ResOMeDIT\",\"\",IF(AND(L40<>\"\",L40<>\"Saisie incomplète\"),VLOOKUP(H40&I40,Référentiel_pour_Sphinx!C:G,5,FALSE),\"\"))","v":""},null,{"$f":"IF(H40=\"MEDICAMENT NON INTEGRE AU GUIDE DU ResOMeDIT\",\"\",IF(AND(L40<>\"\",L40<>\"Saisie incomplète\"),IF(K40=\"Gravité\",VLOOKUP(H40&I40,Référentiel_pour_Sphinx!C:O,11,FALSE),IF(K40=\"Diffuseur\",VLOOKUP(H40&I40,Référentiel_pour_Sphinx!C:O,12,FALSE),IF(K40=\"Système Actif Electrique\",VLOOKUP(H40&I40,Référentiel_pour_Sphinx!C:O,13,FALSE),\"\"))),\"\"))","v":""},{"$f":"IF(INDEX(Référentiel_pour_Sphinx!$A$1:$F$235,MATCH(H40,Référentiel_pour_Sphinx!$A$1:$A$235,0),6)=0,\"\",INDEX(Référentiel_pour_Sphinx!$A$1:$F$235,MATCH(H40,Référentiel_pour_Sphinx!$A$1:$A$235,0),6))","v":{"$error":"#N/A"}},"",""]
[null,"Prescription N°34",null,null,null,null,null,null,null,null,null,null,{"$f":"IF(H41=\"\",\"\",IF(OR(I41=\"\",J41=\"\",K41=\"\"),\"Saisie Incomplète\",IF(H41=\"\",\"\",\nIF(OR(H41=\"MEDICAMENT NON INTEGRE AU GUIDE DU ResOMeDIT\",K41=\"Hors liste\"),\"Situation non intégrée dans le guide ResOMeDIT\",\nIF(K41=Liste!$B$2,\"Situation non intégrée dans le guide ResOMeDIT\",\nIF(K41=Liste!$B$3,INDEX(Référentiel_pour_Sphinx!$A$1:$U$235,MATCH((H41&I41&\"_\"&J41),Référentiel_pour_Sphinx!$D$1:$D$235,0),17),\nIF(K41=Liste!$B$4,INDEX(Référentiel_pour_Sphinx!$A$1:$U$235,MATCH((H41&I41&\"_\"&J41),Référentiel_pour_Sphinx!$D$1:$D$235,0),18),\nIF(K41=Liste!$B$5,INDEX(Référentiel_pour_Sphinx!$A$1:$U$235,MATCH((H41&I41&\"_\"&J41),Référentiel_pour_Sphinx!$D$1:$D$235,0),19),IF(K41=\"Non Renseigné\",\"Non conformité : Prescription incomplète\",\"Situation non intégrée dans le guide ResOMeDIT\")\n))))))))","v":""},null,null,{"$f":"IF(H41=\"MEDICAMENT NON INTEGRE AU GUIDE DU ResOMeDIT\",\"\",IF(AND(L41<>\"\",L41<>\"Saisie incomplète\"),VLOOKUP(H41&I41,Référentiel_pour_Sphinx!C:G,5,FALSE),\"\"))","v":""},null,{"$f":"IF(H41=\"MEDICAMENT NON INTEGRE AU GUIDE DU ResOMeDIT\",\"\",IF(AND(L41<>\"\",L41<>\"Saisie incomplète\"),IF(K41=\"Gravité\",VLOOKUP(H41&I41,Référentiel_pour_Sphinx!C:O,11,FALSE),IF(K41=\"Diffuseur\",VLOOKUP(H41&I41,Référentiel_pour_Sphinx!C:O,12,FALSE),IF(K41=\"Système Actif Electrique\",VLOOKUP(H41&I41,Référentiel_pour_Sphinx!C:O,13,FALSE),\"\"))),\"\"))","v":""},{"$f":"IF(INDEX(Référentiel_pour_Sphinx!$A$1:$F$235,MATCH(H41,Référentiel_pour_Sphinx!$A$1:$A$235,0),6)=0,\"\",INDEX(Référentiel_pour_Sphinx!$A$1:$F$235,MATCH(H41,Référentiel_pour_Sphinx!$A$1:$A$235,0),6))","v":{"$error":"#N/A"}},"",""]
[null,"Prescription N°35",null,null,null,null,null,null,null,null,null,null,{"$f":"IF(H42=\"\",\"\",IF(OR(I42=\"\",J42=\"\",K42=\"\"),\"Saisie Incomplète\",IF(H42=\"\",\"\",\nIF(OR(H42=\"MEDICAMENT NON INTEGRE AU GUIDE DU ResOMeDIT\",K42=\"Hors liste\"),\"Situation non intégrée dans le guide ResOMeDIT\",\nIF(K42=Liste!$B$2,\"Situation non intégrée dans le guide ResOMeDIT\",\nIF(K42=Liste!$B$3,INDEX(Référentiel_pour_Sphinx!$A$1:$U$235,MATCH((H42&I42&\"_\"&J42),Référentiel_pour_Sphinx!$D$1:$D$235,0),17),\nIF(K42=Liste!$B$4,INDEX(Référentiel_pour_Sphinx!$A$1:$U$235,MATCH((H42&I42&\"_\"&J42),Référentiel_pour_Sphinx!$D$1:$D$235,0),18),\nIF(K42=Liste!$B$5,INDEX(Référentiel_pour_Sphinx!$A$1:$U$235,MATCH((H42&I42&\"_\"&J42),Référentiel_pour_Sphinx!$D$1:$D$235,0),19),IF(K42=\"Non Renseigné\",\"Non conformité : Prescription incomplète\",\"Situation non intégrée dans le guide ResOMeDIT\")\n))))))))","v":""},null,null,{"$f":"IF(H42=\"MEDICAMENT NON INTEGRE AU GUIDE DU ResOMeDIT\",\"\",IF(AND(L42<>\"\",L42<>\"Saisie incomplète\"),VLOOKUP(H42&I42,Référentiel_pour_Sphinx!C:G,5,FALSE),\"\"))","v":""},null,{"$f":"IF(H42=\"MEDICAMENT NON INTEGRE AU GUIDE DU ResOMeDIT\",\"\",IF(AND(L42<>\"\",L42<>\"Saisie incomplète\"),IF(K42=\"Gravité\",VLOOKUP(H42&I42,Référentiel_pour_Sphinx!C:O,11,FALSE),IF(K42=\"Diffuseur\",VLOOKUP(H42&I42,Référentiel_pour_Sphinx!C:O,12,FALSE),IF(K42=\"Système Actif Electrique\",VLOOKUP(H42&I42,Référentiel_pour_Sphinx!C:O,13,FALSE),\"\"))),\"\"))","v":""},{"$f":"IF(INDEX(Référentiel_pour_Sphinx!$A$1:$F$235,MATCH(H42,Référentiel_pour_Sphinx!$A$1:$A$235,0),6)=0,\"\",INDEX(Référentiel_pour_Sphinx!$A$1:$F$235,MATCH(H42,Référentiel_pour_Sphinx!$A$1:$A$235,0),6))","v":{"$error":"#N/A"}},"",""]
[null,"Prescription N°36",null,null,null,null,null,null,null,null,null,null,{"$f":"IF(H43=\"\",\"\",IF(OR(I43=\"\",J43=\"\",K43=\"\"),\"Saisie Incomplète\",IF(H43=\"\",\"\",\nIF(OR(H43=\"MEDICAMENT NON INTEGRE AU GUIDE DU ResOMeDIT\",K43=\"Hors liste\"),\"Situation non intégrée dans le guide ResOMeDIT\",\nIF(K43=Liste!$B$2,\"Situation non intégrée dans le guide ResOMeDIT\",\nIF(K43=Liste!$B$3,INDEX(Référentiel_pour_Sphinx!$A$1:$U$235,MATCH((H43&I43&\"_\"&J43),Référentiel_pour_Sphinx!$D$1:$D$235,0),17),\nIF(K43=Liste!$B$4,INDEX(Référentiel_pour_Sphinx!$A$1:$U$235,MATCH((H43&I43&\"_\"&J43),Référentiel_pour_Sphinx!$D$1:$D$235,0),18),\nIF(K43=Liste!$B$5,INDEX(Référentiel_pour_Sphinx!$A$1:$U$235,MATCH((H43&I43&\"_\"&J43),Référentiel_pour_Sphinx!$D$1:$D$235,0),19),IF(K43=\"Non Renseigné\",\"Non conformité : Prescription incomplète\",\"Situation non intégrée dans le guide ResOMeDIT\")\n))))))))","v":""},null,null,{"$f":"IF(H43=\"MEDICAMENT NON INTEGRE AU GUIDE DU ResOMeDIT\",\"\",IF(AND(L43<>\"\",L43<>\"Saisie incomplète\"),VLOOKUP(H43&I43,Référentiel_pour_Sphinx!C:G,5,FALSE),\"\"))","v":""},null,{"$f":"IF(H43=\"MEDICAMENT NON INTEGRE AU GUIDE DU ResOMeDIT\",\"\",IF(AND(L43<>\"\",L43<>\"Saisie incomplète\"),IF(K43=\"Gravité\",VLOOKUP(H43&I43,Référentiel_pour_Sphinx!C:O,11,FALSE),IF(K43=\"Diffuseur\",VLOOKUP(H43&I43,Référentiel_pour_Sphinx!C:O,12,FALSE),IF(K43=\"Système Actif Electrique\",VLOOKUP(H43&I43,Référentiel_pour_Sphinx!C:O,13,FALSE),\"\"))),\"\"))","v":""},{"$f":"IF(INDEX(Référentiel_pour_Sphinx!$A$1:$F$235,MATCH(H43,Référentiel_pour_Sphinx!$A$1:$A$235,0),6)=0,\"\",INDEX(Référentiel_pour_Sphinx!$A$1:$F$235,MATCH(H43,Référentiel_pour_Sphinx!$A$1:$A$235,0),6))","v":{"$error":"#N/A"}},"",""]
[null,"Prescription N°37",null,null,null,null,null,null,null,null,null,null,{"$f":"IF(H44=\"\",\"\",IF(OR(I44=\"\",J44=\"\",K44=\"\"),\"Saisie Incomplète\",IF(H44=\"\",\"\",\nIF(OR(H44=\"MEDICAMENT NON INTEGRE AU GUIDE DU ResOMeDIT\",K44=\"Hors liste\"),\"Situation non intégrée dans le guide ResOMeDIT\",\nIF(K44=Liste!$B$2,\"Situation non intégrée dans le guide ResOMeDIT\",\nIF(K44=Liste!$B$3,INDEX(Référentiel_pour_Sphinx!$A$1:$U$235,MATCH((H44&I44&\"_\"&J44),Référentiel_pour_Sphinx!$D$1:$D$235,0),17),\nIF(K44=Liste!$B$4,INDEX(Référentiel_pour_Sphinx!$A$1:$U$235,MATCH((H44&I44&\"_\"&J44),Référentiel_pour_Sphinx!$D$1:$D$235,0),18),\nIF(K44=Liste!$B$5,INDEX(Référentiel_pour_Sphinx!$A$1:$U$235,MATCH((H44&I44&\"_\"&J44),Référentiel_pour_Sphinx!$D$1:$D$235,0),19),IF(K44=\"Non Renseigné\",\"Non conformité : Prescription incomplète\",\"Situation non intégrée dans le guide ResOMeDIT\")\n))))))))","v":""},null,null,{"$f":"IF(H44=\"MEDICAMENT NON INTEGRE AU GUIDE DU ResOMeDIT\",\"\",IF(AND(L44<>\"\",L44<>\"Saisie incomplète\"),VLOOKUP(H44&I44,Référentiel_pour_Sphinx!C:G,5,FALSE),\"\"))","v":""},null,{"$f":"IF(H44=\"MEDICAMENT NON INTEGRE AU GUIDE DU ResOMeDIT\",\"\",IF(AND(L44<>\"\",L44<>\"Saisie incomplète\"),IF(K44=\"Gravité\",VLOOKUP(H44&I44,Référentiel_pour_Sphinx!C:O,11,FALSE),IF(K44=\"Diffuseur\",VLOOKUP(H44&I44,Référentiel_pour_Sphinx!C:O,12,FALSE),IF(K44=\"Système Actif Electrique\",VLOOKUP(H44&I44,Référentiel_pour_Sphinx!C:O,13,FALSE),\"\"))),\"\"))","v":""},{"$f":"IF(INDEX(Référentiel_pour_Sphinx!$A$1:$F$235,MATCH(H44,Référentiel_pour_Sphinx!$A$1:$A$235,0),6)=0,\"\",INDEX(Référentiel_pour_Sphinx!$A$1:$F$235,MATCH(H44,Référentiel_pour_Sphinx!$A$1:$A$235,0),6))","v":{"$error":"#N/A"}},"",""]
[null,"Prescription N°38",null,null,null,null,null,null,null,null,null,null,{"$f":"IF(H45=\"\",\"\",IF(OR(I45=\"\",J45=\"\",K45=\"\"),\"Saisie Incomplète\",IF(H45=\"\",\"\",\nIF(OR(H45=\"MEDICAMENT NON INTEGRE AU GUIDE DU ResOMeDIT\",K45=\"Hors liste\"),\"Situation non intégrée dans le guide ResOMeDIT\",\nIF(K45=Liste!$B$2,\"Situation non intégrée dans le guide ResOMeDIT\",\nIF(K45=Liste!$B$3,INDEX(Référentiel_pour_Sphinx!$A$1:$U$235,MATCH((H45&I45&\"_\"&J45),Référentiel_pour_Sphinx!$D$1:$D$235,0),17),\nIF(K45=Liste!$B$4,INDEX(Référentiel_pour_Sphinx!$A$1:$U$235,MATCH((H45&I45&\"_\"&J45),Référentiel_pour_Sphinx!$D$1:$D$235,0),18),\nIF(K45=Liste!$B$5,INDEX(Référentiel_pour_Sphinx!$A$1:$U$235,MATCH((H45&I45&\"_\"&J45),Référentiel_pour_Sphinx!$D$1:$D$235,0),19),IF(K45=\"Non Renseigné\",\"Non conformité : Prescription incomplète\",\"Situation non intégrée dans le guide ResOMeDIT\")\n))))))))","v":""},null,null,{"$f":"IF(H45=\"MEDICAMENT NON INTEGRE AU GUIDE DU ResOMeDIT\",\"\",IF(AND(L45<>\"\",L45<>\"Saisie incomplète\"),VLOOKUP(H45&I45,Référentiel_pour_Sphinx!C:G,5,FALSE),\"\"))","v":""},null,{"$f":"IF(H45=\"MEDICAMENT NON INTEGRE AU GUIDE DU ResOMeDIT\",\"\",IF(AND(L45<>\"\",L45<>\"Saisie incomplète\"),IF(K45=\"Gravité\",VLOOKUP(H45&I45,Référentiel_pour_Sphinx!C:O,11,FALSE),IF(K45=\"Diffuseur\",VLOOKUP(H45&I45,Référentiel_pour_Sphinx!C:O,12,FALSE),IF(K45=\"Système Actif Electrique\",VLOOKUP(H45&I45,Référentiel_pour_Sphinx!C:O,13,FALSE),\"\"))),\"\"))","v":""},{"$f":"IF(INDEX(Référentiel_pour_Sphinx!$A$1:$F$235,MATCH(H45,Référentiel_pour_Sphinx!$A$1:$A$235,0),6)=0,\"\",INDEX(Référentiel_pour_Sphinx!$A$1:$F$235,MATCH(H45,Référentiel_pour_Sphinx!$A$1:$A$235,0),6))","v":{"$error":"#N/A"}},"",""]
[null,"Prescription N°39",null,null,null,null,null,null,null,null,null,null,{"$f":"IF(H46=\"\",\"\",IF(OR(I46=\"\",J46=\"\",K46=\"\"),\"Saisie Incomplète\",IF(H46=\"\",\"\",\nIF(OR(H46=\"MEDICAMENT NON INTEGRE AU GUIDE DU ResOMeDIT\",K46=\"Hors liste\"),\"Situation non intégrée dans le guide ResOMeDIT\",\nIF(K46=Liste!$B$2,\"Situation non intégrée dans le guide ResOMeDIT\",\nIF(K46=Liste!$B$3,INDEX(Référentiel_pour_Sphinx!$A$1:$U$235,MATCH((H46&I46&\"_\"&J46),Référentiel_pour_Sphinx!$D$1:$D$235,0),17),\nIF(K46=Liste!$B$4,INDEX(Référentiel_pour_Sphinx!$A$1:$U$235,MATCH((H46&I46&\"_\"&J46),Référentiel_pour_Sphinx!$D$1:$D$235,0),18),\nIF(K46=Liste!$B$5,INDEX(Référentiel_pour_Sphinx!$A$1:$U$235,MATCH((H46&I46&\"_\"&J46),Référentiel_pour_Sphinx!$D$1:$D$235,0),19),IF(K46=\"Non Renseigné\",\"Non conformité : Prescription incomplète\",\"Situation non intégrée dans le guide ResOMeDIT\")\n))))))))","v":""},null,null,{"$f":"IF(H46=\"MEDICAMENT NON INTEGRE AU GUIDE DU ResOMeDIT\",\"\",IF(AND(L46<>\"\",L46<>\"Saisie incomplète\"),VLOOKUP(H46&I46,Référentiel_pour_Sphinx!C:G,5,FALSE),\"\"))","v":""},null,{"$f":"IF(H46=\"MEDICAMENT NON INTEGRE AU GUIDE DU ResOMeDIT\",\"\",IF(AND(L46<>\"\",L46<>\"Saisie incomplète\"),IF(K46=\"Gravité\",VLOOKUP(H46&I46,Référentiel_pour_Sphinx!C:O,11,FALSE),IF(K46=\"Diffuseur\",VLOOKUP(H46&I46,Référentiel_pour_Sphinx!C:O,12,FALSE),IF(K46=\"Système Actif Electrique\",VLOOKUP(H46&I46,Référentiel_pour_Sphinx!C:O,13,FALSE),\"\"))),\"\"))","v":""},{"$f":"IF(INDEX(Référentiel_pour_Sphinx!$A$1:$F$235,MATCH(H46,Référentiel_pour_Sphinx!$A$1:$A$235,0),6)=0,\"\",INDEX(Référentiel_pour_Sphinx!$A$1:$F$235,MATCH(H46,Référentiel_pour_Sphinx!$A$1:$A$235,0),6))","v":{"$error":"#N/A"}},"",""]
[null,"Prescription N°40",null,null,null,null,null,null,null,null,null,null,{"$f":"IF(H47=\"\",\"\",IF(OR(I47=\"\",J47=\"\",K47=\"\"),\"Saisie Incomplète\",IF(H47=\"\",\"\",\nIF(OR(H47=\"MEDICAMENT NON INTEGRE AU GUIDE DU ResOMeDIT\",K47=\"Hors liste\"),\"Situation non intégrée dans le guide ResOMeDIT\",\nIF(K47=Liste!$B$2,\"Situation non intégrée dans le guide ResOMeDIT\",\nIF(K47=Liste!$B$3,INDEX(Référentiel_pour_Sphinx!$A$1:$U$235,MATCH((H47&I47&\"_\"&J47),Référentiel_pour_Sphinx!$D$1:$D$235,0),17),\nIF(K47=Liste!$B$4,INDEX(Référentiel_pour_Sphinx!$A$1:$U$235,MATCH((H47&I47&\"_\"&J47),Référentiel_pour_Sphinx!$D$1:$D$235,0),18),\nIF(K47=Liste!$B$5,INDEX(Référentiel_pour_Sphinx!$A$1:$U$235,MATCH((H47&I47&\"_\"&J47),Référentiel_pour_Sphinx!$D$1:$D$235,0),19),IF(K47=\"Non Renseigné\",\"Non conformité : Prescription incomplète\",\"Situation non intégrée dans le guide ResOMeDIT\")\n))))))))","v":""},null,null,{"$f":"IF(H47=\"MEDICAMENT NON INTEGRE AU GUIDE DU ResOMeDIT\",\"\",IF(AND(L47<>\"\",L47<>\"Saisie incomplète\"),VLOOKUP(H47&I47,Référentiel_pour_Sphinx!C:G,5,FALSE),\"\"))","v":""},null,{"$f":"IF(H47=\"MEDICAMENT NON INTEGRE AU GUIDE DU ResOMeDIT\",\"\",IF(AND(L47<>\"\",L47<>\"Saisie incomplète\"),IF(K47=\"Gravité\",VLOOKUP(H47&I47,Référentiel_pour_Sphinx!C:O,11,FALSE),IF(K47=\"Diffuseur\",VLOOKUP(H47&I47,Référentiel_pour_Sphinx!C:O,12,FALSE),IF(K47=\"Système Actif Electrique\",VLOOKUP(H47&I47,Référentiel_pour_Sphinx!C:O,13,FALSE),\"\"))),\"\"))","v":""},{"$f":"IF(INDEX(Référentiel_pour_Sphinx!$A$1:$F$235,MATCH(H47,Référentiel_pour_Sphinx!$A$1:$A$235,0),6)=0,\"\",INDEX(Référentiel_pour_Sphinx!$A$1:$F$235,MATCH(H47,Référentiel_pour_Sphinx!$A$1:$A$235,0),6))","v":{"$error":"#N/A"}},"",""]
[null,"Prescription N°41",null,null,null,null,null,null,null,null,null,null,{"$f":"IF(H48=\"\",\"\",IF(OR(I48=\"\",J48=\"\",K48=\"\"),\"Saisie Incomplète\",IF(H48=\"\",\"\",\nIF(OR(H48=\"MEDICAMENT NON INTEGRE AU GUIDE DU ResOMeDIT\",K48=\"Hors liste\"),\"Situation non intégrée dans le guide ResOMeDIT\",\nIF(K48=Liste!$B$2,\"Situation non intégrée dans le guide ResOMeDIT\",\nIF(K48=Liste!$B$3,INDEX(Référentiel_pour_Sphinx!$A$1:$U$235,MATCH((H48&I48&\"_\"&J48),Référentiel_pour_Sphinx!$D$1:$D$235,0),17),\nIF(K48=Liste!$B$4,INDEX(Référentiel_pour_Sphinx!$A$1:$U$235,MATCH((H48&I48&\"_\"&J48),Référentiel_pour_Sphinx!$D$1:$D$235,0),18),\nIF(K48=Liste!$B$5,INDEX(Référentiel_pour_Sphinx!$A$1:$U$235,MATCH((H48&I48&\"_\"&J48),Référentiel_pour_Sphinx!$D$1:$D$235,0),19),IF(K48=\"Non Renseigné\",\"Non conformité : Prescription incomplète\",\"Situation non intégrée dans le guide ResOMeDIT\")\n))))))))","v":""},null,null,{"$f":"IF(H48=\"MEDICAMENT NON INTEGRE AU GUIDE DU ResOMeDIT\",\"\",IF(AND(L48<>\"\",L48<>\"Saisie incomplète\"),VLOOKUP(H48&I48,Référentiel_pour_Sphinx!C:G,5,FALSE),\"\"))","v":""},null,{"$f":"IF(H48=\"MEDICAMENT NON INTEGRE AU GUIDE DU ResOMeDIT\",\"\",IF(AND(L48<>\"\",L48<>\"Saisie incomplète\"),IF(K48=\"Gravité\",VLOOKUP(H48&I48,Référentiel_pour_Sphinx!C:O,11,FALSE),IF(K48=\"Diffuseur\",VLOOKUP(H48&I48,Référentiel_pour_Sphinx!C:O,12,FALSE),IF(K48=\"Système Actif Electrique\",VLOOKUP(H48&I48,Référentiel_pour_Sphinx!C:O,13,FALSE),\"\"))),\"\"))","v":""},{"$f":"IF(INDEX(Référentiel_pour_Sphinx!$A$1:$F$235,MATCH(H48,Référentiel_pour_Sphinx!$A$1:$A$235,0),6)=0,\"\",INDEX(Référentiel_pour_Sphinx!$A$1:$F$235,MATCH(H48,Référentiel_pour_Sphinx!$A$1:$A$235,0),6))","v":{"$error":"#N/A"}},"",""]
[null,"Prescription N°42",null,null,null,null,null,null,null,null,null,null,{"$f":"IF(H49=\"\",\"\",IF(OR(I49=\"\",J49=\"\",K49=\"\"),\"Saisie Incomplète\",IF(H49=\"\",\"\",\nIF(OR(H49=\"MEDICAMENT NON INTEGRE AU GUIDE DU ResOMeDIT\",K49=\"Hors liste\"),\"Situation non intégrée dans le guide ResOMeDIT\",\nIF(K49=Liste!$B$2,\"Situation non intégrée dans le guide ResOMeDIT\",\nIF(K49=Liste!$B$3,INDEX(Référentiel_pour_Sphinx!$A$1:$U$235,MATCH((H49&I49&\"_\"&J49),Référentiel_pour_Sphinx!$D$1:$D$235,0),17),\nIF(K49=Liste!$B$4,INDEX(Référentiel_pour_Sphinx!$A$1:$U$235,MATCH((H49&I49&\"_\"&J49),Référentiel_pour_Sphinx!$D$1:$D$235,0),18),\nIF(K49=Liste!$B$5,INDEX(Référentiel_pour_Sphinx!$A$1:$U$235,MATCH((H49&I49&\"_\"&J49),Référentiel_pour_Sphinx!$D$1:$D$235,0),19),IF(K49=\"Non Renseigné\",\"Non conformité : Prescription incomplète\",\"Situation non intégrée dans le guide ResOMeDIT\")\n))))))))","v":""},null,null,{"$f":"IF(H49=\"MEDICAMENT NON INTEGRE AU GUIDE DU ResOMeDIT\",\"\",IF(AND(L49<>\"\",L49<>\"Saisie incomplète\"),VLOOKUP(H49&I49,Référentiel_pour_Sphinx!C:G,5,FALSE),\"\"))","v":""},null,{"$f":"IF(H49=\"MEDICAMENT NON INTEGRE AU GUIDE DU ResOMeDIT\",\"\",IF(AND(L49<>\"\",L49<>\"Saisie incomplète\"),IF(K49=\"Gravité\",VLOOKUP(H49&I49,Référentiel_pour_Sphinx!C:O,11,FALSE),IF(K49=\"Diffuseur\",VLOOKUP(H49&I49,Référentiel_pour_Sphinx!C:O,12,FALSE),IF(K49=\"Système Actif Electrique\",VLOOKUP(H49&I49,Référentiel_pour_Sphinx!C:O,13,FALSE),\"\"))),\"\"))","v":""},{"$f":"IF(INDEX(Référentiel_pour_Sphinx!$A$1:$F$235,MATCH(H49,Référentiel_pour_Sphinx!$A$1:$A$235,0),6)=0,\"\",INDEX(Référentiel_pour_Sphinx!$A$1:$F$235,MATCH(H49,Référentiel_pour_Sphinx!$A$1:$A$235,0),6))","v":{"$error":"#N/A"}},"",""]
[null,"Prescription N°43",null,null,null,null,null,null,null,null,null,null,{"$f":"IF(H50=\"\",\"\",IF(OR(I50=\"\",J50=\"\",K50=\"\"),\"Saisie Incomplète\",IF(H50=\"\",\"\",\nIF(OR(H50=\"MEDICAMENT NON INTEGRE AU GUIDE DU ResOMeDIT\",K50=\"Hors liste\"),\"Situation non intégrée dans le guide ResOMeDIT\",\nIF(K50=Liste!$B$2,\"Situation non intégrée dans le guide ResOMeDIT\",\nIF(K50=Liste!$B$3,INDEX(Référentiel_pour_Sphinx!$A$1:$U$235,MATCH((H50&I50&\"_\"&J50),Référentiel_pour_Sphinx!$D$1:$D$235,0),17),\nIF(K50=Liste!$B$4,INDEX(Référentiel_pour_Sphinx!$A$1:$U$235,MATCH((H50&I50&\"_\"&J50),Référentiel_pour_Sphinx!$D$1:$D$235,0),18),\nIF(K50=Liste!$B$5,INDEX(Référentiel_pour_Sphinx!$A$1:$U$235,MATCH((H50&I50&\"_\"&J50),Référentiel_pour_Sphinx!$D$1:$D$235,0),19),IF(K50=\"Non Renseigné\",\"Non conformité : Prescription incomplète\",\"Situation non intégrée dans le guide ResOMeDIT\")\n))))))))","v":""},null,null,{"$f":"IF(H50=\"MEDICAMENT NON INTEGRE AU GUIDE DU ResOMeDIT\",\"\",IF(AND(L50<>\"\",L50<>\"Saisie incomplète\"),VLOOKUP(H50&I50,Référentiel_pour_Sphinx!C:G,5,FALSE),\"\"))","v":""},null,{"$f":"IF(H50=\"MEDICAMENT NON INTEGRE AU GUIDE DU ResOMeDIT\",\"\",IF(AND(L50<>\"\",L50<>\"Saisie incomplète\"),IF(K50=\"Gravité\",VLOOKUP(H50&I50,Référentiel_pour_Sphinx!C:O,11,FALSE),IF(K50=\"Diffuseur\",VLOOKUP(H50&I50,Référentiel_pour_Sphinx!C:O,12,FALSE),IF(K50=\"Système Actif Electrique\",VLOOKUP(H50&I50,Référentiel_pour_Sphinx!C:O,13,FALSE),\"\"))),\"\"))","v":""},{"$f":"IF(INDEX(Référentiel_pour_Sphinx!$A$1:$F$235,MATCH(H50,Référentiel_pour_Sphinx!$A$1:$A$235,0),6)=0,\"\",INDEX(Référentiel_pour_Sphinx!$A$1:$F$235,MATCH(H50,Référentiel_pour_Sphinx!$A$1:$A$235,0),6))","v":{"$error":"#N/A"}},"",""]
[null,"Prescription N°44",null,null,null,null,null,null,null,null,null,null,{"$f":"IF(H51=\"\",\"\",IF(OR(I51=\"\",J51=\"\",K51=\"\"),\"Saisie Incomplète\",IF(H51=\"\",\"\",\nIF(OR(H51=\"MEDICAMENT NON INTEGRE AU GUIDE DU ResOMeDIT\",K51=\"Hors liste\"),\"Situation non intégrée dans le guide ResOMeDIT\",\nIF(K51=Liste!$B$2,\"Situation non intégrée dans le guide ResOMeDIT\",\nIF(K51=Liste!$B$3,INDEX(Référentiel_pour_Sphinx!$A$1:$U$235,MATCH((H51&I51&\"_\"&J51),Référentiel_pour_Sphinx!$D$1:$D$235,0),17),\nIF(K51=Liste!$B$4,INDEX(Référentiel_pour_Sphinx!$A$1:$U$235,MATCH((H51&I51&\"_\"&J51),Référentiel_pour_Sphinx!$D$1:$D$235,0),18),\nIF(K51=Liste!$B$5,INDEX(Référentiel_pour_Sphinx!$A$1:$U$235,MATCH((H51&I51&\"_\"&J51),Référentiel_pour_Sphinx!$D$1:$D$235,0),19),IF(K51=\"Non Renseigné\",\"Non conformité : Prescription incomplète\",\"Situation non intégrée dans le guide ResOMeDIT\")\n))))))))","v":""},null,null,{"$f":"IF(H51=\"MEDICAMENT NON INTEGRE AU GUIDE DU ResOMeDIT\",\"\",IF(AND(L51<>\"\",L51<>\"Saisie incomplète\"),VLOOKUP(H51&I51,Référentiel_pour_Sphinx!C:G,5,FALSE),\"\"))","v":""},null,{"$f":"IF(H51=\"MEDICAMENT NON INTEGRE AU GUIDE DU ResOMeDIT\",\"\",IF(AND(L51<>\"\",L51<>\"Saisie incomplète\"),IF(K51=\"Gravité\",VLOOKUP(H51&I51,Référentiel_pour_Sphinx!C:O,11,FALSE),IF(K51=\"Diffuseur\",VLOOKUP(H51&I51,Référentiel_pour_Sphinx!C:O,12,FALSE),IF(K51=\"Système Actif Electrique\",VLOOKUP(H51&I51,Référentiel_pour_Sphinx!C:O,13,FALSE),\"\"))),\"\"))","v":""},{"$f":"IF(INDEX(Référentiel_pour_Sphinx!$A$1:$F$235,MATCH(H51,Référentiel_pour_Sphinx!$A$1:$A$235,0),6)=0,\"\",INDEX(Référentiel_pour_Sphinx!$A$1:$F$235,MATCH(H51,Référentiel_pour_Sphinx!$A$1:$A$235,0),6))","v":{"$error":"#N/A"}},"",""]
[null,"Prescription N°45",null,null,null,null,null,null,null,null,null,null,{"$f":"IF(H52=\"\",\"\",IF(OR(I52=\"\",J52=\"\",K52=\"\"),\"Saisie Incomplète\",IF(H52=\"\",\"\",\nIF(OR(H52=\"MEDICAMENT NON INTEGRE AU GUIDE DU ResOMeDIT\",K52=\"Hors liste\"),\"Situation non intégrée dans le guide ResOMeDIT\",\nIF(K52=Liste!$B$2,\"Situation non intégrée dans le guide ResOMeDIT\",\nIF(K52=Liste!$B$3,INDEX(Référentiel_pour_Sphinx!$A$1:$U$235,MATCH((H52&I52&\"_\"&J52),Référentiel_pour_Sphinx!$D$1:$D$235,0),17),\nIF(K52=Liste!$B$4,INDEX(Référentiel_pour_Sphinx!$A$1:$U$235,MATCH((H52&I52&\"_\"&J52),Référentiel_pour_Sphinx!$D$1:$D$235,0),18),\nIF(K52=Liste!$B$5,INDEX(Référentiel_pour_Sphinx!$A$1:$U$235,MATCH((H52&I52&\"_\"&J52),Référentiel_pour_Sphinx!$D$1:$D$235,0),19),IF(K52=\"Non Renseigné\",\"Non conformité : Prescription incomplète\",\"Situation non intégrée dans le guide ResOMeDIT\")\n))))))))","v":""},null,null,{"$f":"IF(H52=\"MEDICAMENT NON INTEGRE AU GUIDE DU ResOMeDIT\",\"\",IF(AND(L52<>\"\",L52<>\"Saisie incomplète\"),VLOOKUP(H52&I52,Référentiel_pour_Sphinx!C:G,5,FALSE),\"\"))","v":""},null,{"$f":"IF(H52=\"MEDICAMENT NON INTEGRE AU GUIDE DU ResOMeDIT\",\"\",IF(AND(L52<>\"\",L52<>\"Saisie incomplète\"),IF(K52=\"Gravité\",VLOOKUP(H52&I52,Référentiel_pour_Sphinx!C:O,11,FALSE),IF(K52=\"Diffuseur\",VLOOKUP(H52&I52,Référentiel_pour_Sphinx!C:O,12,FALSE),IF(K52=\"Système Actif Electrique\",VLOOKUP(H52&I52,Référentiel_pour_Sphinx!C:O,13,FALSE),\"\"))),\"\"))","v":""},{"$f":"IF(INDEX(Référentiel_pour_Sphinx!$A$1:$F$235,MATCH(H52,Référentiel_pour_Sphinx!$A$1:$A$235,0),6)=0,\"\",INDEX(Référentiel_pour_Sphinx!$A$1:$F$235,MATCH(H52,Référentiel_pour_Sphinx!$A$1:$A$235,0),6))","v":{"$error":"#N/A"}},"",""]
[null,"Prescription N°46",null,null,null,null,null,null,null,null,null,null,{"$f":"IF(H53=\"\",\"\",IF(OR(I53=\"\",J53=\"\",K53=\"\"),\"Saisie Incomplète\",IF(H53=\"\",\"\",\nIF(OR(H53=\"MEDICAMENT NON INTEGRE AU GUIDE DU ResOMeDIT\",K53=\"Hors liste\"),\"Situation non intégrée dans le guide ResOMeDIT\",\nIF(K53=Liste!$B$2,\"Situation non intégrée dans le guide ResOMeDIT\",\nIF(K53=Liste!$B$3,INDEX(Référentiel_pour_Sphinx!$A$1:$U$235,MATCH((H53&I53&\"_\"&J53),Référentiel_pour_Sphinx!$D$1:$D$235,0),17),\nIF(K53=Liste!$B$4,INDEX(Référentiel_pour_Sphinx!$A$1:$U$235,MATCH((H53&I53&\"_\"&J53),Référentiel_pour_Sphinx!$D$1:$D$235,0),18),\nIF(K53=Liste!$B$5,INDEX(Référentiel_pour_Sphinx!$A$1:$U$235,MATCH((H53&I53&\"_\"&J53),Référentiel_pour_Sphinx!$D$1:$D$235,0),19),IF(K53=\"Non Renseigné\",\"Non conformité : Prescription incomplète\",\"Situation non intégrée dans le guide ResOMeDIT\")\n))))))))","v":""},null,null,{"$f":"IF(H53=\"MEDICAMENT NON INTEGRE AU GUIDE DU ResOMeDIT\",\"\",IF(AND(L53<>\"\",L53<>\"Saisie incomplète\"),VLOOKUP(H53&I53,Référentiel_pour_Sphinx!C:G,5,FALSE),\"\"))","v":""},null,{"$f":"IF(H53=\"MEDICAMENT NON INTEGRE AU GUIDE DU ResOMeDIT\",\"\",IF(AND(L53<>\"\",L53<>\"Saisie incomplète\"),IF(K53=\"Gravité\",VLOOKUP(H53&I53,Référentiel_pour_Sphinx!C:O,11,FALSE),IF(K53=\"Diffuseur\",VLOOKUP(H53&I53,Référentiel_pour_Sphinx!C:O,12,FALSE),IF(K53=\"Système Actif Electrique\",VLOOKUP(H53&I53,Référentiel_pour_Sphinx!C:O,13,FALSE),\"\"))),\"\"))","v":""},{"$f":"IF(INDEX(Référentiel_pour_Sphinx!$A$1:$F$235,MATCH(H53,Référentiel_pour_Sphinx!$A$1:$A$235,0),6)=0,\"\",INDEX(Référentiel_pour_Sphinx!$A$1:$F$235,MATCH(H53,Référentiel_pour_Sphinx!$A$1:$A$235,0),6))","v":{"$error":"#N/A"}},"",""]
[null,"Prescription N°47",null,null,null,null,null,null,null,null,null,null,{"$f":"IF(H54=\"\",\"\",IF(OR(I54=\"\",J54=\"\",K54=\"\"),\"Saisie Incomplète\",IF(H54=\"\",\"\",\nIF(OR(H54=\"MEDICAMENT NON INTEGRE AU GUIDE DU ResOMeDIT\",K54=\"Hors liste\"),\"Situation non intégrée dans le guide ResOMeDIT\",\nIF(K54=Liste!$B$2,\"Situation non intégrée dans le guide ResOMeDIT\",\nIF(K54=Liste!$B$3,INDEX(Référentiel_pour_Sphinx!$A$1:$U$235,MATCH((H54&I54&\"_\"&J54),Référentiel_pour_Sphinx!$D$1:$D$235,0),17),\nIF(K54=Liste!$B$4,INDEX(Référentiel_pour_Sphinx!$A$1:$U$235,MATCH((H54&I54&\"_\"&J54),Référentiel_pour_Sphinx!$D$1:$D$235,0),18),\nIF(K54=Liste!$B$5,INDEX(Référentiel_pour_Sphinx!$A$1:$U$235,MATCH((H54&I54&\"_\"&J54),Référentiel_pour_Sphinx!$D$1:$D$235,0),19),IF(K54=\"Non Renseigné\",\"Non conformité : Prescription incomplète\",\"Situation non intégrée dans le guide ResOMeDIT\")\n))))))))","v":""},null,null,{"$f":"IF(H54=\"MEDICAMENT NON INTEGRE AU GUIDE DU ResOMeDIT\",\"\",IF(AND(L54<>\"\",L54<>\"Saisie incomplète\"),VLOOKUP(H54&I54,Référentiel_pour_Sphinx!C:G,5,FALSE),\"\"))","v":""},null,{"$f":"IF(H54=\"MEDICAMENT NON INTEGRE AU GUIDE DU ResOMeDIT\",\"\",IF(AND(L54<>\"\",L54<>\"Saisie incomplète\"),IF(K54=\"Gravité\",VLOOKUP(H54&I54,Référentiel_pour_Sphinx!C:O,11,FALSE),IF(K54=\"Diffuseur\",VLOOKUP(H54&I54,Référentiel_pour_Sphinx!C:O,12,FALSE),IF(K54=\"Système Actif Electrique\",VLOOKUP(H54&I54,Référentiel_pour_Sphinx!C:O,13,FALSE),\"\"))),\"\"))","v":""},{"$f":"IF(INDEX(Référentiel_pour_Sphinx!$A$1:$F$235,MATCH(H54,Référentiel_pour_Sphinx!$A$1:$A$235,0),6)=0,\"\",INDEX(Référentiel_pour_Sphinx!$A$1:$F$235,MATCH(H54,Référentiel_pour_Sphinx!$A$1:$A$235,0),6))","v":{"$error":"#N/A"}},"",""]
[null,"Prescription N°48",null,null,null,null,null,null,null,null,null,null,{"$f":"IF(H55=\"\",\"\",IF(OR(I55=\"\",J55=\"\",K55=\"\"),\"Saisie Incomplète\",IF(H55=\"\",\"\",\nIF(OR(H55=\"MEDICAMENT NON INTEGRE AU GUIDE DU ResOMeDIT\",K55=\"Hors liste\"),\"Situation non intégrée dans le guide ResOMeDIT\",\nIF(K55=Liste!$B$2,\"Situation non intégrée dans le guide ResOMeDIT\",\nIF(K55=Liste!$B$3,INDEX(Référentiel_pour_Sphinx!$A$1:$U$235,MATCH((H55&I55&\"_\"&J55),Référentiel_pour_Sphinx!$D$1:$D$235,0),17),\nIF(K55=Liste!$B$4,INDEX(Référentiel_pour_Sphinx!$A$1:$U$235,MATCH((H55&I55&\"_\"&J55),Référentiel_pour_Sphinx!$D$1:$D$235,0),18),\nIF(K55=Liste!$B$5,INDEX(Référentiel_pour_Sphinx!$A$1:$U$235,MATCH((H55&I55&\"_\"&J55),Référentiel_pour_Sphinx!$D$1:$D$235,0),19),IF(K55=\"Non Renseigné\",\"Non conformité : Prescription incomplète\",\"Situation non intégrée dans le guide ResOMeDIT\")\n))))))))","v":""},null,null,{"$f":"IF(H55=\"MEDICAMENT NON INTEGRE AU GUIDE DU ResOMeDIT\",\"\",IF(AND(L55<>\"\",L55<>\"Saisie incomplète\"),VLOOKUP(H55&I55,Référentiel_pour_Sphinx!C:G,5,FALSE),\"\"))","v":""},null,{"$f":"IF(H55=\"MEDICAMENT NON INTEGRE AU GUIDE DU ResOMeDIT\",\"\",IF(AND(L55<>\"\",L55<>\"Saisie incomplète\"),IF(K55=\"Gravité\",VLOOKUP(H55&I55,Référentiel_pour_Sphinx!C:O,11,FALSE),IF(K55=\"Diffuseur\",VLOOKUP(H55&I55,Référentiel_pour_Sphinx!C:O,12,FALSE),IF(K55=\"Système Actif Electrique\",VLOOKUP(H55&I55,Référentiel_pour_Sphinx!C:O,13,FALSE),\"\"))),\"\"))","v":""},{"$f":"IF(INDEX(Référentiel_pour_Sphinx!$A$1:$F$235,MATCH(H55,Référentiel_pour_Sphinx!$A$1:$A$235,0),6)=0,\"\",INDEX(Référentiel_pour_Sphinx!$A$1:$F$235,MATCH(H55,Référentiel_pour_Sphinx!$A$1:$A$235,0),6))","v":{"$error":"#N/A"}},"",""]
[null,"Prescription N°49",null,null,null,null,null,null,null,null,null,null,{"$f":"IF(H56=\"\",\"\",IF(OR(I56=\"\",J56=\"\",K56=\"\"),\"Saisie Incomplète\",IF(H56=\"\",\"\",\nIF(OR(H56=\"MEDICAMENT NON INTEGRE AU GUIDE DU ResOMeDIT\",K56=\"Hors liste\"),\"Situation non intégrée dans le guide ResOMeDIT\",\nIF(K56=Liste!$B$2,\"Situation non intégrée dans le guide ResOMeDIT\",\nIF(K56=Liste!$B$3,INDEX(Référentiel_pour_Sphinx!$A$1:$U$235,MATCH((H56&I56&\"_\"&J56),Référentiel_pour_Sphinx!$D$1:$D$235,0),17),\nIF(K56=Liste!$B$4,INDEX(Référentiel_pour_Sphinx!$A$1:$U$235,MATCH((H56&I56&\"_\"&J56),Référentiel_pour_Sphinx!$D$1:$D$235,0),18),\nIF(K56=Liste!$B$5,INDEX(Référentiel_pour_Sphinx!$A$1:$U$235,MATCH((H56&I56&\"_\"&J56),Référentiel_pour_Sphinx!$D$1:$D$235,0),19),IF(K56=\"Non Renseigné\",\"Non conformité : Prescription incomplète\",\"Situation non intégrée dans le guide ResOMeDIT\")\n))))))))","v":""},null,null,{"$f":"IF(H56=\"MEDICAMENT NON INTEGRE AU GUIDE DU ResOMeDIT\",\"\",IF(AND(L56<>\"\",L56<>\"Saisie incomplète\"),VLOOKUP(H56&I56,Référentiel_pour_Sphinx!C:G,5,FALSE),\"\"))","v":""},null,{"$f":"IF(H56=\"MEDICAMENT NON INTEGRE AU GUIDE DU ResOMeDIT\",\"\",IF(AND(L56<>\"\",L56<>\"Saisie incomplète\"),IF(K56=\"Gravité\",VLOOKUP(H56&I56,Référentiel_pour_Sphinx!C:O,11,FALSE),IF(K56=\"Diffuseur\",VLOOKUP(H56&I56,Référentiel_pour_Sphinx!C:O,12,FALSE),IF(K56=\"Système Actif Electrique\",VLOOKUP(H56&I56,Référentiel_pour_Sphinx!C:O,13,FALSE),\"\"))),\"\"))","v":""},{"$f":"IF(INDEX(Référentiel_pour_Sphinx!$A$1:$F$235,MATCH(H56,Référentiel_pour_Sphinx!$A$1:$A$235,0),6)=0,\"\",INDEX(Référentiel_pour_Sphinx!$A$1:$F$235,MATCH(H56,Référentiel_pour_Sphinx!$A$1:$A$235,0),6))","v":{"$error":"#N/A"}},"",""]
[null,"Prescription N°50",null,null,null,null,null,null,null,null,null,null,{"$f":"IF(H57=\"\",\"\",IF(OR(I57=\"\",J57=\"\",K57=\"\"),\"Saisie Incomplète\",IF(H57=\"\",\"\",\nIF(OR(H57=\"MEDICAMENT NON INTEGRE AU GUIDE DU ResOMeDIT\",K57=\"Hors liste\"),\"Situation non intégrée dans le guide ResOMeDIT\",\nIF(K57=Liste!$B$2,\"Situation non intégrée dans le guide ResOMeDIT\",\nIF(K57=Liste!$B$3,INDEX(Référentiel_pour_Sphinx!$A$1:$U$235,MATCH((H57&I57&\"_\"&J57),Référentiel_pour_Sphinx!$D$1:$D$235,0),17),\nIF(K57=Liste!$B$4,INDEX(Référentiel_pour_Sphinx!$A$1:$U$235,MATCH((H57&I57&\"_\"&J57),Référentiel_pour_Sphinx!$D$1:$D$235,0),18),\nIF(K57=Liste!$B$5,INDEX(Référentiel_pour_Sphinx!$A$1:$U$235,MATCH((H57&I57&\"_\"&J57),Référentiel_pour_Sphinx!$D$1:$D$235,0),19),IF(K57=\"Non Renseigné\",\"Non conformité : Prescription incomplète\",\"Situation non intégrée dans le guide ResOMeDIT\")\n))))))))","v":""},null,null,{"$f":"IF(H57=\"MEDICAMENT NON INTEGRE AU GUIDE DU ResOMeDIT\",\"\",IF(AND(L57<>\"\",L57<>\"Saisie incomplète\"),VLOOKUP(H57&I57,Référentiel_pour_Sphinx!C:G,5,FALSE),\"\"))","v":""},null,{"$f":"IF(H57=\"MEDICAMENT NON INTEGRE AU GUIDE DU ResOMeDIT\",\"\",IF(AND(L57<>\"\",L57<>\"Saisie incomplète\"),IF(K57=\"Gravité\",VLOOKUP(H57&I57,Référentiel_pour_Sphinx!C:O,11,FALSE),IF(K57=\"Diffuseur\",VLOOKUP(H57&I57,Référentiel_pour_Sphinx!C:O,12,FALSE),IF(K57=\"Système Actif Electrique\",VLOOKUP(H57&I57,Référentiel_pour_Sphinx!C:O,13,FALSE),\"\"))),\"\"))","v":""},{"$f":"IF(INDEX(Référentiel_pour_Sphinx!$A$1:$F$235,MATCH(H57,Référentiel_pour_Sphinx!$A$1:$A$235,0),6)=0,\"\",INDEX(Référentiel_pour_Sphinx!$A$1:$F$235,MATCH(H57,Référentiel_pour_Sphinx!$A$1:$A$235,0),6))","v":{"$error":"#N/A"}},"",""]
[null,"Prescription N°51",null,null,null,null,null,null,null,null,null,null,{"$f":"IF(H58=\"\",\"\",IF(OR(I58=\"\",J58=\"\",K58=\"\"),\"Saisie Incomplète\",IF(H58=\"\",\"\",\nIF(OR(H58=\"MEDICAMENT NON INTEGRE AU GUIDE DU ResOMeDIT\",K58=\"Hors liste\"),\"Situation non intégrée dans le guide ResOMeDIT\",\nIF(K58=Liste!$B$2,\"Situation non intégrée dans le guide ResOMeDIT\",\nIF(K58=Liste!$B$3,INDEX(Référentiel_pour_Sphinx!$A$1:$U$235,MATCH((H58&I58&\"_\"&J58),Référentiel_pour_Sphinx!$D$1:$D$235,0),17),\nIF(K58=Liste!$B$4,INDEX(Référentiel_pour_Sphinx!$A$1:$U$235,MATCH((H58&I58&\"_\"&J58),Référentiel_pour_Sphinx!$D$1:$D$235,0),18),\nIF(K58=Liste!$B$5,INDEX(Référentiel_pour_Sphinx!$A$1:$U$235,MATCH((H58&I58&\"_\"&J58),Référentiel_pour_Sphinx!$D$1:$D$235,0),19),IF(K58=\"Non Renseigné\",\"Non conformité : Prescription incomplète\",\"Situation non intégrée dans le guide ResOMeDIT\")\n))))))))","v":""},null,null,{"$f":"IF(H58=\"MEDICAMENT NON INTEGRE AU GUIDE DU ResOMeDIT\",\"\",IF(AND(L58<>\"\",L58<>\"Saisie incomplète\"),VLOOKUP(H58&I58,Référentiel_pour_Sphinx!C:G,5,FALSE),\"\"))","v":""},null,{"$f":"IF(H58=\"MEDICAMENT NON INTEGRE AU GUIDE DU ResOMeDIT\",\"\",IF(AND(L58<>\"\",L58<>\"Saisie incomplète\"),IF(K58=\"Gravité\",VLOOKUP(H58&I58,Référentiel_pour_Sphinx!C:O,11,FALSE),IF(K58=\"Diffuseur\",VLOOKUP(H58&I58,Référentiel_pour_Sphinx!C:O,12,FALSE),IF(K58=\"Système Actif Electrique\",VLOOKUP(H58&I58,Référentiel_pour_Sphinx!C:O,13,FALSE),\"\"))),\"\"))","v":""},{"$f":"IF(INDEX(Référentiel_pour_Sphinx!$A$1:$F$235,MATCH(H58,Référentiel_pour_Sphinx!$A$1:$A$235,0),6)=0,\"\",INDEX(Référentiel_pour_Sphinx!$A$1:$F$235,MATCH(H58,Référentiel_pour_Sphinx!$A$1:$A$235,0),6))","v":{"$error":"#N/A"}},"",""]
[null,"Prescription N°52",null,null,null,null,null,null,null,null,null,null,{"$f":"IF(H59=\"\",\"\",IF(OR(I59=\"\",J59=\"\",K59=\"\"),\"Saisie Incomplète\",IF(H59=\"\",\"\",\nIF(OR(H59=\"MEDICAMENT NON INTEGRE AU GUIDE DU ResOMeDIT\",K59=\"Hors liste\"),\"Situation non intégrée dans le guide ResOMeDIT\",\nIF(K59=Liste!$B$2,\"Situation non intégrée dans le guide ResOMeDIT\",\nIF(K59=Liste!$B$3,INDEX(Référentiel_pour_Sphinx!$A$1:$U$235,MATCH((H59&I59&\"_\"&J59),Référentiel_pour_Sphinx!$D$1:$D$235,0),17),\nIF(K59=Liste!$B$4,INDEX(Référentiel_pour_Sphinx!$A$1:$U$235,MATCH((H59&I59&\"_\"&J59),Référentiel_pour_Sphinx!$D$1:$D$235,0),18),\nIF(K59=Liste!$B$5,INDEX(Référentiel_pour_Sphinx!$A$1:$U$235,MATCH((H59&I59&\"_\"&J59),Référentiel_pour_Sphinx!$D$1:$D$235,0),19),IF(K59=\"Non Renseigné\",\"Non conformité : Prescription incomplète\",\"Situation non intégrée dans le guide ResOMeDIT\")\n))))))))","v":""},null,null,{"$f":"IF(H59=\"MEDICAMENT NON INTEGRE AU GUIDE DU ResOMeDIT\",\"\",IF(AND(L59<>\"\",L59<>\"Saisie incomplète\"),VLOOKUP(H59&I59,Référentiel_pour_Sphinx!C:G,5,FALSE),\"\"))","v":""},null,{"$f":"IF(H59=\"MEDICAMENT NON INTEGRE AU GUIDE DU ResOMeDIT\",\"\",IF(AND(L59<>\"\",L59<>\"Saisie incomplète\"),IF(K59=\"Gravité\",VLOOKUP(H59&I59,Référentiel_pour_Sphinx!C:O,11,FALSE),IF(K59=\"Diffuseur\",VLOOKUP(H59&I59,Référentiel_pour_Sphinx!C:O,12,FALSE),IF(K59=\"Système Actif Electrique\",VLOOKUP(H59&I59,Référentiel_pour_Sphinx!C:O,13,FALSE),\"\"))),\"\"))","v":""},{"$f":"IF(INDEX(Référentiel_pour_Sphinx!$A$1:$F$235,MATCH(H59,Référentiel_pour_Sphinx!$A$1:$A$235,0),6)=0,\"\",INDEX(Référentiel_pour_Sphinx!$A$1:$F$235,MATCH(H59,Référentiel_pour_Sphinx!$A$1:$A$235,0),6))","v":{"$error":"#N/A"}},"",""]
[null,"Prescription N°53",null,null,null,null,null,null,null,null,null,null,{"$f":"IF(H60=\"\",\"\",IF(OR(I60=\"\",J60=\"\",K60=\"\"),\"Saisie Incomplète\",IF(H60=\"\",\"\",\nIF(OR(H60=\"MEDICAMENT NON INTEGRE AU GUIDE DU ResOMeDIT\",K60=\"Hors liste\"),\"Situation non intégrée dans le guide ResOMeDIT\",\nIF(K60=Liste!$B$2,\"Situation non intégrée dans le guide ResOMeDIT\",\nIF(K60=Liste!$B$3,INDEX(Référentiel_pour_Sphinx!$A$1:$U$235,MATCH((H60&I60&\"_\"&J60),Référentiel_pour_Sphinx!$D$1:$D$235,0),17),\nIF(K60=Liste!$B$4,INDEX(Référentiel_pour_Sphinx!$A$1:$U$235,MATCH((H60&I60&\"_\"&J60),Référentiel_pour_Sphinx!$D$1:$D$235,0),18),\nIF(K60=Liste!$B$5,INDEX(Référentiel_pour_Sphinx!$A$1:$U$235,MATCH((H60&I60&\"_\"&J60),Référentiel_pour_Sphinx!$D$1:$D$235,0),19),IF(K60=\"Non Renseigné\",\"Non conformité : Prescription incomplète\",\"Situation non intégrée dans le guide ResOMeDIT\")\n))))))))","v":""},null,null,{"$f":"IF(H60=\"MEDICAMENT NON INTEGRE AU GUIDE DU ResOMeDIT\",\"\",IF(AND(L60<>\"\",L60<>\"Saisie incomplète\"),VLOOKUP(H60&I60,Référentiel_pour_Sphinx!C:G,5,FALSE),\"\"))","v":""},null,{"$f":"IF(H60=\"MEDICAMENT NON INTEGRE AU GUIDE DU ResOMeDIT\",\"\",IF(AND(L60<>\"\",L60<>\"Saisie incomplète\"),IF(K60=\"Gravité\",VLOOKUP(H60&I60,Référentiel_pour_Sphinx!C:O,11,FALSE),IF(K60=\"Diffuseur\",VLOOKUP(H60&I60,Référentiel_pour_Sphinx!C:O,12,FALSE),IF(K60=\"Système Actif Electrique\",VLOOKUP(H60&I60,Référentiel_pour_Sphinx!C:O,13,FALSE),\"\"))),\"\"))","v":""},{"$f":"IF(INDEX(Référentiel_pour_Sphinx!$A$1:$F$235,MATCH(H60,Référentiel_pour_Sphinx!$A$1:$A$235,0),6)=0,\"\",INDEX(Référentiel_pour_Sphinx!$A$1:$F$235,MATCH(H60,Référentiel_pour_Sphinx!$A$1:$A$235,0),6))","v":{"$error":"#N/A"}},"",""]
[null,"Prescription N°54",null,null,null,null,null,null,null,null,null,null,{"$f":"IF(H61=\"\",\"\",IF(OR(I61=\"\",J61=\"\",K61=\"\"),\"Saisie Incomplète\",IF(H61=\"\",\"\",\nIF(OR(H61=\"MEDICAMENT NON INTEGRE AU GUIDE DU ResOMeDIT\",K61=\"Hors liste\"),\"Situation non intégrée dans le guide ResOMeDIT\",\nIF(K61=Liste!$B$2,\"Situation non intégrée dans le guide ResOMeDIT\",\nIF(K61=Liste!$B$3,INDEX(Référentiel_pour_Sphinx!$A$1:$U$235,MATCH((H61&I61&\"_\"&J61),Référentiel_pour_Sphinx!$D$1:$D$235,0),17),\nIF(K61=Liste!$B$4,INDEX(Référentiel_pour_Sphinx!$A$1:$U$235,MATCH((H61&I61&\"_\"&J61),Référentiel_pour_Sphinx!$D$1:$D$235,0),18),\nIF(K61=Liste!$B$5,INDEX(Référentiel_pour_Sphinx!$A$1:$U$235,MATCH((H61&I61&\"_\"&J61),Référentiel_pour_Sphinx!$D$1:$D$235,0),19),IF(K61=\"Non Renseigné\",\"Non conformité : Prescription incomplète\",\"Situation non intégrée dans le guide ResOMeDIT\")\n))))))))","v":""},null,null,{"$f":"IF(H61=\"MEDICAMENT NON INTEGRE AU GUIDE DU ResOMeDIT\",\"\",IF(AND(L61<>\"\",L61<>\"Saisie incomplète\"),VLOOKUP(H61&I61,Référentiel_pour_Sphinx!C:G,5,FALSE),\"\"))","v":""},null,{"$f":"IF(H61=\"MEDICAMENT NON INTEGRE AU GUIDE DU ResOMeDIT\",\"\",IF(AND(L61<>\"\",L61<>\"Saisie incomplète\"),IF(K61=\"Gravité\",VLOOKUP(H61&I61,Référentiel_pour_Sphinx!C:O,11,FALSE),IF(K61=\"Diffuseur\",VLOOKUP(H61&I61,Référentiel_pour_Sphinx!C:O,12,FALSE),IF(K61=\"Système Actif Electrique\",VLOOKUP(H61&I61,Référentiel_pour_Sphinx!C:O,13,FALSE),\"\"))),\"\"))","v":""},{"$f":"IF(INDEX(Référentiel_pour_Sphinx!$A$1:$F$235,MATCH(H61,Référentiel_pour_Sphinx!$A$1:$A$235,0),6)=0,\"\",INDEX(Référentiel_pour_Sphinx!$A$1:$F$235,MATCH(H61,Référentiel_pour_Sphinx!$A$1:$A$235,0),6))","v":{"$error":"#N/A"}},"",""]
[null,"Prescription N°55",null,null,null,null,null,null,null,null,null,null,{"$f":"IF(H62=\"\",\"\",IF(OR(I62=\"\",J62=\"\",K62=\"\"),\"Saisie Incomplète\",IF(H62=\"\",\"\",\nIF(OR(H62=\"MEDICAMENT NON INTEGRE AU GUIDE DU ResOMeDIT\",K62=\"Hors liste\"),\"Situation non intégrée dans le guide ResOMeDIT\",\nIF(K62=Liste!$B$2,\"Situation non intégrée dans le guide ResOMeDIT\",\nIF(K62=Liste!$B$3,INDEX(Référentiel_pour_Sphinx!$A$1:$U$235,MATCH((H62&I62&\"_\"&J62),Référentiel_pour_Sphinx!$D$1:$D$235,0),17),\nIF(K62=Liste!$B$4,INDEX(Référentiel_pour_Sphinx!$A$1:$U$235,MATCH((H62&I62&\"_\"&J62),Référentiel_pour_Sphinx!$D$1:$D$235,0),18),\nIF(K62=Liste!$B$5,INDEX(Référentiel_pour_Sphinx!$A$1:$U$235,MATCH((H62&I62&\"_\"&J62),Référentiel_pour_Sphinx!$D$1:$D$235,0),19),IF(K62=\"Non Renseigné\",\"Non conformité : Prescription incomplète\",\"Situation non intégrée dans le guide ResOMeDIT\")\n))))))))","v":""},null,null,{"$f":"IF(H62=\"MEDICAMENT NON INTEGRE AU GUIDE DU ResOMeDIT\",\"\",IF(AND(L62<>\"\",L62<>\"Saisie incomplète\"),VLOOKUP(H62&I62,Référentiel_pour_Sphinx!C:G,5,FALSE),\"\"))","v":""},null,{"$f":"IF(H62=\"MEDICAMENT NON INTEGRE AU GUIDE DU ResOMeDIT\",\"\",IF(AND(L62<>\"\",L62<>\"Saisie incomplète\"),IF(K62=\"Gravité\",VLOOKUP(H62&I62,Référentiel_pour_Sphinx!C:O,11,FALSE),IF(K62=\"Diffuseur\",VLOOKUP(H62&I62,Référentiel_pour_Sphinx!C:O,12,FALSE),IF(K62=\"Système Actif Electrique\",VLOOKUP(H62&I62,Référentiel_pour_Sphinx!C:O,13,FALSE),\"\"))),\"\"))","v":""},{"$f":"IF(INDEX(Référentiel_pour_Sphinx!$A$1:$F$235,MATCH(H62,Référentiel_pour_Sphinx!$A$1:$A$235,0),6)=0,\"\",INDEX(Référentiel_pour_Sphinx!$A$1:$F$235,MATCH(H62,Référentiel_pour_Sphinx!$A$1:$A$235,0),6))","v":{"$error":"#N/A"}},"",""]
[null,"Prescription N°56",null,null,null,null,null,null,null,null,null,null,{"$f":"IF(H63=\"\",\"\",IF(OR(I63=\"\",J63=\"\",K63=\"\"),\"Saisie Incomplète\",IF(H63=\"\",\"\",\nIF(OR(H63=\"MEDICAMENT NON INTEGRE AU GUIDE DU ResOMeDIT\",K63=\"Hors liste\"),\"Situation non intégrée dans le guide ResOMeDIT\",\nIF(K63=Liste!$B$2,\"Situation non intégrée dans le guide ResOMeDIT\",\nIF(K63=Liste!$B$3,INDEX(Référentiel_pour_Sphinx!$A$1:$U$235,MATCH((H63&I63&\"_\"&J63),Référentiel_pour_Sphinx!$D$1:$D$235,0),17),\nIF(K63=Liste!$B$4,INDEX(Référentiel_pour_Sphinx!$A$1:$U$235,MATCH((H63&I63&\"_\"&J63),Référentiel_pour_Sphinx!$D$1:$D$235,0),18),\nIF(K63=Liste!$B$5,INDEX(Référentiel_pour_Sphinx!$A$1:$U$235,MATCH((H63&I63&\"_\"&J63),Référentiel_pour_Sphinx!$D$1:$D$235,0),19),IF(K63=\"Non Renseigné\",\"Non conformité : Prescription incomplète\",\"Situation non intégrée dans le guide ResOMeDIT\")\n))))))))","v":""},null,null,{"$f":"IF(H63=\"MEDICAMENT NON INTEGRE AU GUIDE DU ResOMeDIT\",\"\",IF(AND(L63<>\"\",L63<>\"Saisie incomplète\"),VLOOKUP(H63&I63,Référentiel_pour_Sphinx!C:G,5,FALSE),\"\"))","v":""},null,{"$f":"IF(H63=\"MEDICAMENT NON INTEGRE AU GUIDE DU ResOMeDIT\",\"\",IF(AND(L63<>\"\",L63<>\"Saisie incomplète\"),IF(K63=\"Gravité\",VLOOKUP(H63&I63,Référentiel_pour_Sphinx!C:O,11,FALSE),IF(K63=\"Diffuseur\",VLOOKUP(H63&I63,Référentiel_pour_Sphinx!C:O,12,FALSE),IF(K63=\"Système Actif Electrique\",VLOOKUP(H63&I63,Référentiel_pour_Sphinx!C:O,13,FALSE),\"\"))),\"\"))","v":""},{"$f":"IF(INDEX(Référentiel_pour_Sphinx!$A$1:$F$235,MATCH(H63,Référentiel_pour_Sphinx!$A$1:$A$235,0),6)=0,\"\",INDEX(Référentiel_pour_Sphinx!$A$1:$F$235,MATCH(H63,Référentiel_pour_Sphinx!$A$1:$A$235,0),6))","v":{"$error":"#N/A"}},"",""]
[null,"Prescription N°57",null,null,null,null,null,null,null,null,null,null,{"$f":"IF(H64=\"\",\"\",IF(OR(I64=\"\",J64=\"\",K64=\"\"),\"Saisie Incomplète\",IF(H64=\"\",\"\",\nIF(OR(H64=\"MEDICAMENT NON INTEGRE AU GUIDE DU ResOMeDIT\",K64=\"Hors liste\"),\"Situation non intégrée dans le guide ResOMeDIT\",\nIF(K64=Liste!$B$2,\"Situation non intégrée dans le guide ResOMeDIT\",\nIF(K64=Liste!$B$3,INDEX(Référentiel_pour_Sphinx!$A$1:$U$235,MATCH((H64&I64&\"_\"&J64),Référentiel_pour_Sphinx!$D$1:$D$235,0),17),\nIF(K64=Liste!$B$4,INDEX(Référentiel_pour_Sphinx!$A$1:$U$235,MATCH((H64&I64&\"_\"&J64),Référentiel_pour_Sphinx!$D$1:$D$235,0),18),\nIF(K64=Liste!$B$5,INDEX(Référentiel_pour_Sphinx!$A$1:$U$235,MATCH((H64&I64&\"_\"&J64),Référentiel_pour_Sphinx!$D$1:$D$235,0),19),IF(K64=\"Non Renseigné\",\"Non conformité : Prescription incomplète\",\"Situation non intégrée dans le guide ResOMeDIT\")\n))))))))","v":""},null,null,{"$f":"IF(H64=\"MEDICAMENT NON INTEGRE AU GUIDE DU ResOMeDIT\",\"\",IF(AND(L64<>\"\",L64<>\"Saisie incomplète\"),VLOOKUP(H64&I64,Référentiel_pour_Sphinx!C:G,5,FALSE),\"\"))","v":""},null,{"$f":"IF(H64=\"MEDICAMENT NON INTEGRE AU GUIDE DU ResOMeDIT\",\"\",IF(AND(L64<>\"\",L64<>\"Saisie incomplète\"),IF(K64=\"Gravité\",VLOOKUP(H64&I64,Référentiel_pour_Sphinx!C:O,11,FALSE),IF(K64=\"Diffuseur\",VLOOKUP(H64&I64,Référentiel_pour_Sphinx!C:O,12,FALSE),IF(K64=\"Système Actif Electrique\",VLOOKUP(H64&I64,Référentiel_pour_Sphinx!C:O,13,FALSE),\"\"))),\"\"))","v":""},{"$f":"IF(INDEX(Référentiel_pour_Sphinx!$A$1:$F$235,MATCH(H64,Référentiel_pour_Sphinx!$A$1:$A$235,0),6)=0,\"\",INDEX(Référentiel_pour_Sphinx!$A$1:$F$235,MATCH(H64,Référentiel_pour_Sphinx!$A$1:$A$235,0),6))","v":{"$error":"#N/A"}},"",""]
[null,"Prescription N°58",null,null,null,null,null,null,null,null,null,null,{"$f":"IF(H65=\"\",\"\",IF(OR(I65=\"\",J65=\"\",K65=\"\"),\"Saisie Incomplète\",IF(H65=\"\",\"\",\nIF(OR(H65=\"MEDICAMENT NON INTEGRE AU GUIDE DU ResOMeDIT\",K65=\"Hors liste\"),\"Situation non intégrée dans le guide ResOMeDIT\",\nIF(K65=Liste!$B$2,\"Situation non intégrée dans le guide ResOMeDIT\",\nIF(K65=Liste!$B$3,INDEX(Référentiel_pour_Sphinx!$A$1:$U$235,MATCH((H65&I65&\"_\"&J65),Référentiel_pour_Sphinx!$D$1:$D$235,0),17),\nIF(K65=Liste!$B$4,INDEX(Référentiel_pour_Sphinx!$A$1:$U$235,MATCH((H65&I65&\"_\"&J65),Référentiel_pour_Sphinx!$D$1:$D$235,0),18),\nIF(K65=Liste!$B$5,INDEX(Référentiel_pour_Sphinx!$A$1:$U$235,MATCH((H65&I65&\"_\"&J65),Référentiel_pour_Sphinx!$D$1:$D$235,0),19),IF(K65=\"Non Renseigné\",\"Non conformité : Prescription incomplète\",\"Situation non intégrée dans le guide ResOMeDIT\")\n))))))))","v":""},null,null,{"$f":"IF(H65=\"MEDICAMENT NON INTEGRE AU GUIDE DU ResOMeDIT\",\"\",IF(AND(L65<>\"\",L65<>\"Saisie incomplète\"),VLOOKUP(H65&I65,Référentiel_pour_Sphinx!C:G,5,FALSE),\"\"))","v":""},null,{"$f":"IF(H65=\"MEDICAMENT NON INTEGRE AU GUIDE DU ResOMeDIT\",\"\",IF(AND(L65<>\"\",L65<>\"Saisie incomplète\"),IF(K65=\"Gravité\",VLOOKUP(H65&I65,Référentiel_pour_Sphinx!C:O,11,FALSE),IF(K65=\"Diffuseur\",VLOOKUP(H65&I65,Référentiel_pour_Sphinx!C:O,12,FALSE),IF(K65=\"Système Actif Electrique\",VLOOKUP(H65&I65,Référentiel_pour_Sphinx!C:O,13,FALSE),\"\"))),\"\"))","v":""},{"$f":"IF(INDEX(Référentiel_pour_Sphinx!$A$1:$F$235,MATCH(H65,Référentiel_pour_Sphinx!$A$1:$A$235,0),6)=0,\"\",INDEX(Référentiel_pour_Sphinx!$A$1:$F$235,MATCH(H65,Référentiel_pour_Sphinx!$A$1:$A$235,0),6))","v":{"$error":"#N/A"}},"",""]
[null,"Prescription N°59",null,null,null,null,null,null,null,null,null,null,{"$f":"IF(H66=\"\",\"\",IF(OR(I66=\"\",J66=\"\",K66=\"\"),\"Saisie Incomplète\",IF(H66=\"\",\"\",\nIF(OR(H66=\"MEDICAMENT NON INTEGRE AU GUIDE DU ResOMeDIT\",K66=\"Hors liste\"),\"Situation non intégrée dans le guide ResOMeDIT\",\nIF(K66=Liste!$B$2,\"Situation non intégrée dans le guide ResOMeDIT\",\nIF(K66=Liste!$B$3,INDEX(Référentiel_pour_Sphinx!$A$1:$U$235,MATCH((H66&I66&\"_\"&J66),Référentiel_pour_Sphinx!$D$1:$D$235,0),17),\nIF(K66=Liste!$B$4,INDEX(Référentiel_pour_Sphinx!$A$1:$U$235,MATCH((H66&I66&\"_\"&J66),Référentiel_pour_Sphinx!$D$1:$D$235,0),18),\nIF(K66=Liste!$B$5,INDEX(Référentiel_pour_Sphinx!$A$1:$U$235,MATCH((H66&I66&\"_\"&J66),Référentiel_pour_Sphinx!$D$1:$D$235,0),19),IF(K66=\"Non Renseigné\",\"Non conformité : Prescription incomplète\",\"Situation non intégrée dans le guide ResOMeDIT\")\n))))))))","v":""},null,null,{"$f":"IF(H66=\"MEDICAMENT NON INTEGRE AU GUIDE DU ResOMeDIT\",\"\",IF(AND(L66<>\"\",L66<>\"Saisie incomplète\"),VLOOKUP(H66&I66,Référentiel_pour_Sphinx!C:G,5,FALSE),\"\"))","v":""},null,{"$f":"IF(H66=\"MEDICAMENT NON INTEGRE AU GUIDE DU ResOMeDIT\",\"\",IF(AND(L66<>\"\",L66<>\"Saisie incomplète\"),IF(K66=\"Gravité\",VLOOKUP(H66&I66,Référentiel_pour_Sphinx!C:O,11,FALSE),IF(K66=\"Diffuseur\",VLOOKUP(H66&I66,Référentiel_pour_Sphinx!C:O,12,FALSE),IF(K66=\"Système Actif Electrique\",VLOOKUP(H66&I66,Référentiel_pour_Sphinx!C:O,13,FALSE),\"\"))),\"\"))","v":""},{"$f":"IF(INDEX(Référentiel_pour_Sphinx!$A$1:$F$235,MATCH(H66,Référentiel_pour_Sphinx!$A$1:$A$235,0),6)=0,\"\",INDEX(Référentiel_pour_Sphinx!$A$1:$F$235,MATCH(H66,Référentiel_pour_Sphinx!$A$1:$A$235,0),6))","v":{"$error":"#N/A"}},"",""]
[null,"Prescription N°60",null,null,null,null,null,null,null,null,null,null,{"$f":"IF(H67=\"\",\"\",IF(OR(I67=\"\",J67=\"\",K67=\"\"),\"Saisie Incomplète\",IF(H67=\"\",\"\",\nIF(OR(H67=\"MEDICAMENT NON INTEGRE AU GUIDE DU ResOMeDIT\",K67=\"Hors liste\"),\"Situation non intégrée dans le guide ResOMeDIT\",\nIF(K67=Liste!$B$2,\"Situation non intégrée dans le guide ResOMeDIT\",\nIF(K67=Liste!$B$3,INDEX(Référentiel_pour_Sphinx!$A$1:$U$235,MATCH((H67&I67&\"_\"&J67),Référentiel_pour_Sphinx!$D$1:$D$235,0),17),\nIF(K67=Liste!$B$4,INDEX(Référentiel_pour_Sphinx!$A$1:$U$235,MATCH((H67&I67&\"_\"&J67),Référentiel_pour_Sphinx!$D$1:$D$235,0),18),\nIF(K67=Liste!$B$5,INDEX(Référentiel_pour_Sphinx!$A$1:$U$235,MATCH((H67&I67&\"_\"&J67),Référentiel_pour_Sphinx!$D$1:$D$235,0),19),IF(K67=\"Non Renseigné\",\"Non conformité : Prescription incomplète\",\"Situation non intégrée dans le guide ResOMeDIT\")\n))))))))","v":""},null,null,{"$f":"IF(H67=\"MEDICAMENT NON INTEGRE AU GUIDE DU ResOMeDIT\",\"\",IF(AND(L67<>\"\",L67<>\"Saisie incomplète\"),VLOOKUP(H67&I67,Référentiel_pour_Sphinx!C:G,5,FALSE),\"\"))","v":""},null,{"$f":"IF(H67=\"MEDICAMENT NON INTEGRE AU GUIDE DU ResOMeDIT\",\"\",IF(AND(L67<>\"\",L67<>\"Saisie incomplète\"),IF(K67=\"Gravité\",VLOOKUP(H67&I67,Référentiel_pour_Sphinx!C:O,11,FALSE),IF(K67=\"Diffuseur\",VLOOKUP(H67&I67,Référentiel_pour_Sphinx!C:O,12,FALSE),IF(K67=\"Système Actif Electrique\",VLOOKUP(H67&I67,Référentiel_pour_Sphinx!C:O,13,FALSE),\"\"))),\"\"))","v":""},{"$f":"IF(INDEX(Référentiel_pour_Sphinx!$A$1:$F$235,MATCH(H67,Référentiel_pour_Sphinx!$A$1:$A$235,0),6)=0,\"\",INDEX(Référentiel_pour_Sphinx!$A$1:$F$235,MATCH(H67,Référentiel_pour_Sphinx!$A$1:$A$235,0),6))","v":{"$error":"#N/A"}},"",""]
[null,"Prescription N°61",null,null,null,null,null,null,null,null,null,null,{"$f":"IF(H68=\"\",\"\",IF(OR(I68=\"\",J68=\"\",K68=\"\"),\"Saisie Incomplète\",IF(H68=\"\",\"\",\nIF(OR(H68=\"MEDICAMENT NON INTEGRE AU GUIDE DU ResOMeDIT\",K68=\"Hors liste\"),\"Situation non intégrée dans le guide ResOMeDIT\",\nIF(K68=Liste!$B$2,\"Situation non intégrée dans le guide ResOMeDIT\",\nIF(K68=Liste!$B$3,INDEX(Référentiel_pour_Sphinx!$A$1:$U$235,MATCH((H68&I68&\"_\"&J68),Référentiel_pour_Sphinx!$D$1:$D$235,0),17),\nIF(K68=Liste!$B$4,INDEX(Référentiel_pour_Sphinx!$A$1:$U$235,MATCH((H68&I68&\"_\"&J68),Référentiel_pour_Sphinx!$D$1:$D$235,0),18),\nIF(K68=Liste!$B$5,INDEX(Référentiel_pour_Sphinx!$A$1:$U$235,MATCH((H68&I68&\"_\"&J68),Référentiel_pour_Sphinx!$D$1:$D$235,0),19),IF(K68=\"Non Renseigné\",\"Non conformité : Prescription incomplète\",\"Situation non intégrée dans le guide ResOMeDIT\")\n))))))))","v":""},null,null,{"$f":"IF(H68=\"MEDICAMENT NON INTEGRE AU GUIDE DU ResOMeDIT\",\"\",IF(AND(L68<>\"\",L68<>\"Saisie incomplète\"),VLOOKUP(H68&I68,Référentiel_pour_Sphinx!C:G,5,FALSE),\"\"))","v":""},null,{"$f":"IF(H68=\"MEDICAMENT NON INTEGRE AU GUIDE DU ResOMeDIT\",\"\",IF(AND(L68<>\"\",L68<>\"Saisie incomplète\"),IF(K68=\"Gravité\",VLOOKUP(H68&I68,Référentiel_pour_Sphinx!C:O,11,FALSE),IF(K68=\"Diffuseur\",VLOOKUP(H68&I68,Référentiel_pour_Sphinx!C:O,12,FALSE),IF(K68=\"Système Actif Electrique\",VLOOKUP(H68&I68,Référentiel_pour_Sphinx!C:O,13,FALSE),\"\"))),\"\"))","v":""},{"$f":"IF(INDEX(Référentiel_pour_Sphinx!$A$1:$F$235,MATCH(H68,Référentiel_pour_Sphinx!$A$1:$A$235,0),6)=0,\"\",INDEX(Référentiel_pour_Sphinx!$A$1:$F$235,MATCH(H68,Référentiel_pour_Sphinx!$A$1:$A$235,0),6))","v":{"$error":"#N/A"}},"",""]
[null,"Prescription N°62",null,null,null,null,null,null,null,null,null,null,{"$f":"IF(H69=\"\",\"\",IF(OR(I69=\"\",J69=\"\",K69=\"\"),\"Saisie Incomplète\",IF(H69=\"\",\"\",\nIF(OR(H69=\"MEDICAMENT NON INTEGRE AU GUIDE DU ResOMeDIT\",K69=\"Hors liste\"),\"Situation non intégrée dans le guide ResOMeDIT\",\nIF(K69=Liste!$B$2,\"Situation non intégrée dans le guide ResOMeDIT\",\nIF(K69=Liste!$B$3,INDEX(Référentiel_pour_Sphinx!$A$1:$U$235,MATCH((H69&I69&\"_\"&J69),Référentiel_pour_Sphinx!$D$1:$D$235,0),17),\nIF(K69=Liste!$B$4,INDEX(Référentiel_pour_Sphinx!$A$1:$U$235,MATCH((H69&I69&\"_\"&J69),Référentiel_pour_Sphinx!$D$1:$D$235,0),18),\nIF(K69=Liste!$B$5,INDEX(Référentiel_pour_Sphinx!$A$1:$U$235,MATCH((H69&I69&\"_\"&J69),Référentiel_pour_Sphinx!$D$1:$D$235,0),19),IF(K69=\"Non Renseigné\",\"Non conformité : Prescription incomplète\",\"Situation non intégrée dans le guide ResOMeDIT\")\n))))))))","v":""},null,null,{"$f":"IF(H69=\"MEDICAMENT NON INTEGRE AU GUIDE DU ResOMeDIT\",\"\",IF(AND(L69<>\"\",L69<>\"Saisie incomplète\"),VLOOKUP(H69&I69,Référentiel_pour_Sphinx!C:G,5,FALSE),\"\"))","v":""},null,{"$f":"IF(H69=\"MEDICAMENT NON INTEGRE AU GUIDE DU ResOMeDIT\",\"\",IF(AND(L69<>\"\",L69<>\"Saisie incomplète\"),IF(K69=\"Gravité\",VLOOKUP(H69&I69,Référentiel_pour_Sphinx!C:O,11,FALSE),IF(K69=\"Diffuseur\",VLOOKUP(H69&I69,Référentiel_pour_Sphinx!C:O,12,FALSE),IF(K69=\"Système Actif Electrique\",VLOOKUP(H69&I69,Référentiel_pour_Sphinx!C:O,13,FALSE),\"\"))),\"\"))","v":""},{"$f":"IF(INDEX(Référentiel_pour_Sphinx!$A$1:$F$235,MATCH(H69,Référentiel_pour_Sphinx!$A$1:$A$235,0),6)=0,\"\",INDEX(Référentiel_pour_Sphinx!$A$1:$F$235,MATCH(H69,Référentiel_pour_Sphinx!$A$1:$A$235,0),6))","v":{"$error":"#N/A"}},"",""]
[null,"Prescription N°63",null,null,null,null,null,null,null,null,null,null,{"$f":"IF(H70=\"\",\"\",IF(OR(I70=\"\",J70=\"\",K70=\"\"),\"Saisie Incomplète\",IF(H70=\"\",\"\",\nIF(OR(H70=\"MEDICAMENT NON INTEGRE AU GUIDE DU ResOMeDIT\",K70=\"Hors liste\"),\"Situation non intégrée dans le guide ResOMeDIT\",\nIF(K70=Liste!$B$2,\"Situation non intégrée dans le guide ResOMeDIT\",\nIF(K70=Liste!$B$3,INDEX(Référentiel_pour_Sphinx!$A$1:$U$235,MATCH((H70&I70&\"_\"&J70),Référentiel_pour_Sphinx!$D$1:$D$235,0),17),\nIF(K70=Liste!$B$4,INDEX(Référentiel_pour_Sphinx!$A$1:$U$235,MATCH((H70&I70&\"_\"&J70),Référentiel_pour_Sphinx!$D$1:$D$235,0),18),\nIF(K70=Liste!$B$5,INDEX(Référentiel_pour_Sphinx!$A$1:$U$235,MATCH((H70&I70&\"_\"&J70),Référentiel_pour_Sphinx!$D$1:$D$235,0),19),IF(K70=\"Non Renseigné\",\"Non conformité : Prescription incomplète\",\"Situation non intégrée dans le guide ResOMeDIT\")\n))))))))","v":""},null,null,{"$f":"IF(H70=\"MEDICAMENT NON INTEGRE AU GUIDE DU ResOMeDIT\",\"\",IF(AND(L70<>\"\",L70<>\"Saisie incomplète\"),VLOOKUP(H70&I70,Référentiel_pour_Sphinx!C:G,5,FALSE),\"\"))","v":""},null,{"$f":"IF(H70=\"MEDICAMENT NON INTEGRE AU GUIDE DU ResOMeDIT\",\"\",IF(AND(L70<>\"\",L70<>\"Saisie incomplète\"),IF(K70=\"Gravité\",VLOOKUP(H70&I70,Référentiel_pour_Sphinx!C:O,11,FALSE),IF(K70=\"Diffuseur\",VLOOKUP(H70&I70,Référentiel_pour_Sphinx!C:O,12,FALSE),IF(K70=\"Système Actif Electrique\",VLOOKUP(H70&I70,Référentiel_pour_Sphinx!C:O,13,FALSE),\"\"))),\"\"))","v":""},{"$f":"IF(INDEX(Référentiel_pour_Sphinx!$A$1:$F$235,MATCH(H70,Référentiel_pour_Sphinx!$A$1:$A$235,0),6)=0,\"\",INDEX(Référentiel_pour_Sphinx!$A$1:$F$235,MATCH(H70,Référentiel_pour_Sphinx!$A$1:$A$235,0),6))","v":{"$error":"#N/A"}},"",""]
[null,"Prescription N°64",null,null,null,null,null,null,null,null,null,null,{"$f":"IF(H71=\"\",\"\",IF(OR(I71=\"\",J71=\"\",K71=\"\"),\"Saisie Incomplète\",IF(H71=\"\",\"\",\nIF(OR(H71=\"MEDICAMENT NON INTEGRE AU GUIDE DU ResOMeDIT\",K71=\"Hors liste\"),\"Situation non intégrée dans le guide ResOMeDIT\",\nIF(K71=Liste!$B$2,\"Situation non intégrée dans le guide ResOMeDIT\",\nIF(K71=Liste!$B$3,INDEX(Référentiel_pour_Sphinx!$A$1:$U$235,MATCH((H71&I71&\"_\"&J71),Référentiel_pour_Sphinx!$D$1:$D$235,0),17),\nIF(K71=Liste!$B$4,INDEX(Référentiel_pour_Sphinx!$A$1:$U$235,MATCH((H71&I71&\"_\"&J71),Référentiel_pour_Sphinx!$D$1:$D$235,0),18),\nIF(K71=Liste!$B$5,INDEX(Référentiel_pour_Sphinx!$A$1:$U$235,MATCH((H71&I71&\"_\"&J71),Référentiel_pour_Sphinx!$D$1:$D$235,0),19),IF(K71=\"Non Renseigné\",\"Non conformité : Prescription incomplète\",\"Situation non intégrée dans le guide ResOMeDIT\")\n))))))))","v":""},null,null,{"$f":"IF(H71=\"MEDICAMENT NON INTEGRE AU GUIDE DU ResOMeDIT\",\"\",IF(AND(L71<>\"\",L71<>\"Saisie incomplète\"),VLOOKUP(H71&I71,Référentiel_pour_Sphinx!C:G,5,FALSE),\"\"))","v":""},null,{"$f":"IF(H71=\"MEDICAMENT NON INTEGRE AU GUIDE DU ResOMeDIT\",\"\",IF(AND(L71<>\"\",L71<>\"Saisie incomplète\"),IF(K71=\"Gravité\",VLOOKUP(H71&I71,Référentiel_pour_Sphinx!C:O,11,FALSE),IF(K71=\"Diffuseur\",VLOOKUP(H71&I71,Référentiel_pour_Sphinx!C:O,12,FALSE),IF(K71=\"Système Actif Electrique\",VLOOKUP(H71&I71,Référentiel_pour_Sphinx!C:O,13,FALSE),\"\"))),\"\"))","v":""},{"$f":"IF(INDEX(Référentiel_pour_Sphinx!$A$1:$F$235,MATCH(H71,Référentiel_pour_Sphinx!$A$1:$A$235,0),6)=0,\"\",INDEX(Référentiel_pour_Sphinx!$A$1:$F$235,MATCH(H71,Référentiel_pour_Sphinx!$A$1:$A$235,0),6))","v":{"$error":"#N/A"}},"",""]
[null,"Prescription N°65",null,null,null,null,null,null,null,null,null,null,{"$f":"IF(H72=\"\",\"\",IF(OR(I72=\"\",J72=\"\",K72=\"\"),\"Saisie Incomplète\",IF(H72=\"\",\"\",\nIF(OR(H72=\"MEDICAMENT NON INTEGRE AU GUIDE DU ResOMeDIT\",K72=\"Hors liste\"),\"Situation non intégrée dans le guide ResOMeDIT\",\nIF(K72=Liste!$B$2,\"Situation non intégrée dans le guide ResOMeDIT\",\nIF(K72=Liste!$B$3,INDEX(Référentiel_pour_Sphinx!$A$1:$U$235,MATCH((H72&I72&\"_\"&J72),Référentiel_pour_Sphinx!$D$1:$D$235,0),17),\nIF(K72=Liste!$B$4,INDEX(Référentiel_pour_Sphinx!$A$1:$U$235,MATCH((H72&I72&\"_\"&J72),Référentiel_pour_Sphinx!$D$1:$D$235,0),18),\nIF(K72=Liste!$B$5,INDEX(Référentiel_pour_Sphinx!$A$1:$U$235,MATCH((H72&I72&\"_\"&J72),Référentiel_pour_Sphinx!$D$1:$D$235,0),19),IF(K72=\"Non Renseigné\",\"Non conformité : Prescription incomplète\",\"Situation non intégrée dans le guide ResOMeDIT\")\n))))))))","v":""},null,null,{"$f":"IF(H72=\"MEDICAMENT NON INTEGRE AU GUIDE DU ResOMeDIT\",\"\",IF(AND(L72<>\"\",L72<>\"Saisie incomplète\"),VLOOKUP(H72&I72,Référentiel_pour_Sphinx!C:G,5,FALSE),\"\"))","v":""},null,{"$f":"IF(H72=\"MEDICAMENT NON INTEGRE AU GUIDE DU ResOMeDIT\",\"\",IF(AND(L72<>\"\",L72<>\"Saisie incomplète\"),IF(K72=\"Gravité\",VLOOKUP(H72&I72,Référentiel_pour_Sphinx!C:O,11,FALSE),IF(K72=\"Diffuseur\",VLOOKUP(H72&I72,Référentiel_pour_Sphinx!C:O,12,FALSE),IF(K72=\"Système Actif Electrique\",VLOOKUP(H72&I72,Référentiel_pour_Sphinx!C:O,13,FALSE),\"\"))),\"\"))","v":""},{"$f":"IF(INDEX(Référentiel_pour_Sphinx!$A$1:$F$235,MATCH(H72,Référentiel_pour_Sphinx!$A$1:$A$235,0),6)=0,\"\",INDEX(Référentiel_pour_Sphinx!$A$1:$F$235,MATCH(H72,Référentiel_pour_Sphinx!$A$1:$A$235,0),6))","v":{"$error":"#N/A"}},"",""]
[null,"Prescription N°66",null,null,null,null,null,null,null,null,null,null,{"$f":"IF(H73=\"\",\"\",IF(OR(I73=\"\",J73=\"\",K73=\"\"),\"Saisie Incomplète\",IF(H73=\"\",\"\",\nIF(OR(H73=\"MEDICAMENT NON INTEGRE AU GUIDE DU ResOMeDIT\",K73=\"Hors liste\"),\"Situation non intégrée dans le guide ResOMeDIT\",\nIF(K73=Liste!$B$2,\"Situation non intégrée dans le guide ResOMeDIT\",\nIF(K73=Liste!$B$3,INDEX(Référentiel_pour_Sphinx!$A$1:$U$235,MATCH((H73&I73&\"_\"&J73),Référentiel_pour_Sphinx!$D$1:$D$235,0),17),\nIF(K73=Liste!$B$4,INDEX(Référentiel_pour_Sphinx!$A$1:$U$235,MATCH((H73&I73&\"_\"&J73),Référentiel_pour_Sphinx!$D$1:$D$235,0),18),\nIF(K73=Liste!$B$5,INDEX(Référentiel_pour_Sphinx!$A$1:$U$235,MATCH((H73&I73&\"_\"&J73),Référentiel_pour_Sphinx!$D$1:$D$235,0),19),IF(K73=\"Non Renseigné\",\"Non conformité : Prescription incomplète\",\"Situation non intégrée dans le guide ResOMeDIT\")\n))))))))","v":""},null,null,{"$f":"IF(H73=\"MEDICAMENT NON INTEGRE AU GUIDE DU ResOMeDIT\",\"\",IF(AND(L73<>\"\",L73<>\"Saisie incomplète\"),VLOOKUP(H73&I73,Référentiel_pour_Sphinx!C:G,5,FALSE),\"\"))","v":""},null,{"$f":"IF(H73=\"MEDICAMENT NON INTEGRE AU GUIDE DU ResOMeDIT\",\"\",IF(AND(L73<>\"\",L73<>\"Saisie incomplète\"),IF(K73=\"Gravité\",VLOOKUP(H73&I73,Référentiel_pour_Sphinx!C:O,11,FALSE),IF(K73=\"Diffuseur\",VLOOKUP(H73&I73,Référentiel_pour_Sphinx!C:O,12,FALSE),IF(K73=\"Système Actif Electrique\",VLOOKUP(H73&I73,Référentiel_pour_Sphinx!C:O,13,FALSE),\"\"))),\"\"))","v":""},{"$f":"IF(INDEX(Référentiel_pour_Sphinx!$A$1:$F$235,MATCH(H73,Référentiel_pour_Sphinx!$A$1:$A$235,0),6)=0,\"\",INDEX(Référentiel_pour_Sphinx!$A$1:$F$235,MATCH(H73,Référentiel_pour_Sphinx!$A$1:$A$235,0),6))","v":{"$error":"#N/A"}},{"$f":"IF(D73<>\"\",TEXT(D73,\"mmmm\"),\"\")","v":""},{"$f":"IF(D73<>\"\",YEAR(D73),\"\")","v":""}]
[null,"Prescription N°67",null,null,null,null,null,null,null,null,null,null,{"$f":"IF(H74=\"\",\"\",IF(OR(I74=\"\",J74=\"\",K74=\"\"),\"Saisie Incomplète\",IF(H74=\"\",\"\",\nIF(OR(H74=\"MEDICAMENT NON INTEGRE AU GUIDE DU ResOMeDIT\",K74=\"Hors liste\"),\"Situation non intégrée dans le guide ResOMeDIT\",\nIF(K74=Liste!$B$2,\"Situation non intégrée dans le guide ResOMeDIT\",\nIF(K74=Liste!$B$3,INDEX(Référentiel_pour_Sphinx!$A$1:$U$235,MATCH((H74&I74&\"_\"&J74),Référentiel_pour_Sphinx!$D$1:$D$235,0),17),\nIF(K74=Liste!$B$4,INDEX(Référentiel_pour_Sphinx!$A$1:$U$235,MATCH((H74&I74&\"_\"&J74),Référentiel_pour_Sphinx!$D$1:$D$235,0),18),\nIF(K74=Liste!$B$5,INDEX(Référentiel_pour_Sphinx!$A$1:$U$235,MATCH((H74&I74&\"_\"&J74),Référentiel_pour_Sphinx!$D$1:$D$235,0),19),IF(K74=\"Non Renseigné\",\"Non conformité : Prescription incomplète\",\"Situation non intégrée dans le guide ResOMeDIT\")\n))))))))","v":""},null,null,{"$f":"IF(H74=\"MEDICAMENT NON INTEGRE AU GUIDE DU ResOMeDIT\",\"\",IF(AND(L74<>\"\",L74<>\"Saisie incomplète\"),VLOOKUP(H74&I74,Référentiel_pour_Sphinx!C:G,5,FALSE),\"\"))","v":""},null,{"$f":"IF(H74=\"MEDICAMENT NON INTEGRE AU GUIDE DU ResOMeDIT\",\"\",IF(AND(L74<>\"\",L74<>\"Saisie incomplète\"),IF(K74=\"Gravité\",VLOOKUP(H74&I74,Référentiel_pour_Sphinx!C:O,11,FALSE),IF(K74=\"Diffuseur\",VLOOKUP(H74&I74,Référentiel_pour_Sphinx!C:O,12,FALSE),IF(K74=\"Système Actif Electrique\",VLOOKUP(H74&I74,Référentiel_pour_Sphinx!C:O,13,FALSE),\"\"))),\"\"))","v":""},{"$f":"IF(INDEX(Référentiel_pour_Sphinx!$A$1:$F$235,MATCH(H74,Référentiel_pour_Sphinx!$A$1:$A$235,0),6)=0,\"\",INDEX(Référentiel_pour_Sphinx!$A$1:$F$235,MATCH(H74,Référentiel_pour_Sphinx!$A$1:$A$235,0),6))","v":{"$error":"#N/A"}},"",""]
[null,"Prescription N°68",null,null,null,null,null,null,null,null,null,null,{"$f":"IF(H75=\"\",\"\",IF(OR(I75=\"\",J75=\"\",K75=\"\"),\"Saisie Incomplète\",IF(H75=\"\",\"\",\nIF(OR(H75=\"MEDICAMENT NON INTEGRE AU GUIDE DU ResOMeDIT\",K75=\"Hors liste\"),\"Situation non intégrée dans le guide ResOMeDIT\",\nIF(K75=Liste!$B$2,\"Situation non intégrée dans le guide ResOMeDIT\",\nIF(K75=Liste!$B$3,INDEX(Référentiel_pour_Sphinx!$A$1:$U$235,MATCH((H75&I75&\"_\"&J75),Référentiel_pour_Sphinx!$D$1:$D$235,0),17),\nIF(K75=Liste!$B$4,INDEX(Référentiel_pour_Sphinx!$A$1:$U$235,MATCH((H75&I75&\"_\"&J75),Référentiel_pour_Sphinx!$D$1:$D$235,0),18),\nIF(K75=Liste!$B$5,INDEX(Référentiel_pour_Sphinx!$A$1:$U$235,MATCH((H75&I75&\"_\"&J75),Référentiel_pour_Sphinx!$D$1:$D$235,0),19),IF(K75=\"Non Renseigné\",\"Non conformité : Prescription incomplète\",\"Situation non intégrée dans le guide ResOMeDIT\")\n))))))))","v":""},null,null,{"$f":"IF(H75=\"MEDICAMENT NON INTEGRE AU GUIDE DU ResOMeDIT\",\"\",IF(AND(L75<>\"\",L75<>\"Saisie incomplète\"),VLOOKUP(H75&I75,Référentiel_pour_Sphinx!C:G,5,FALSE),\"\"))","v":""},null,{"$f":"IF(H75=\"MEDICAMENT NON INTEGRE AU GUIDE DU ResOMeDIT\",\"\",IF(AND(L75<>\"\",L75<>\"Saisie incomplète\"),IF(K75=\"Gravité\",VLOOKUP(H75&I75,Référentiel_pour_Sphinx!C:O,11,FALSE),IF(K75=\"Diffuseur\",VLOOKUP(H75&I75,Référentiel_pour_Sphinx!C:O,12,FALSE),IF(K75=\"Système Actif Electrique\",VLOOKUP(H75&I75,Référentiel_pour_Sphinx!C:O,13,FALSE),\"\"))),\"\"))","v":""},{"$f":"IF(INDEX(Référentiel_pour_Sphinx!$A$1:$F$235,MATCH(H75,Référentiel_pour_Sphinx!$A$1:$A$235,0),6)=0,\"\",INDEX(Référentiel_pour_Sphinx!$A$1:$F$235,MATCH(H75,Référentiel_pour_Sphinx!$A$1:$A$235,0),6))","v":{"$error":"#N/A"}},"",""]
[null,"Prescription N°69",null,null,null,null,null,null,null,null,null,null,{"$f":"IF(H76=\"\",\"\",IF(OR(I76=\"\",J76=\"\",K76=\"\"),\"Saisie Incomplète\",IF(H76=\"\",\"\",\nIF(OR(H76=\"MEDICAMENT NON INTEGRE AU GUIDE DU ResOMeDIT\",K76=\"Hors liste\"),\"Situation non intégrée dans le guide ResOMeDIT\",\nIF(K76=Liste!$B$2,\"Situation non intégrée dans le guide ResOMeDIT\",\nIF(K76=Liste!$B$3,INDEX(Référentiel_pour_Sphinx!$A$1:$U$235,MATCH((H76&I76&\"_\"&J76),Référentiel_pour_Sphinx!$D$1:$D$235,0),17),\nIF(K76=Liste!$B$4,INDEX(Référentiel_pour_Sphinx!$A$1:$U$235,MATCH((H76&I76&\"_\"&J76),Référentiel_pour_Sphinx!$D$1:$D$235,0),18),\nIF(K76=Liste!$B$5,INDEX(Référentiel_pour_Sphinx!$A$1:$U$235,MATCH((H76&I76&\"_\"&J76),Référentiel_pour_Sphinx!$D$1:$D$235,0),19),IF(K76=\"Non Renseigné\",\"Non conformité : Prescription incomplète\",\"Situation non intégrée dans le guide ResOMeDIT\")\n))))))))","v":""},null,null,{"$f":"IF(H76=\"MEDICAMENT NON INTEGRE AU GUIDE DU ResOMeDIT\",\"\",IF(AND(L76<>\"\",L76<>\"Saisie incomplète\"),VLOOKUP(H76&I76,Référentiel_pour_Sphinx!C:G,5,FALSE),\"\"))","v":""},null,{"$f":"IF(H76=\"MEDICAMENT NON INTEGRE AU GUIDE DU ResOMeDIT\",\"\",IF(AND(L76<>\"\",L76<>\"Saisie incomplète\"),IF(K76=\"Gravité\",VLOOKUP(H76&I76,Référentiel_pour_Sphinx!C:O,11,FALSE),IF(K76=\"Diffuseur\",VLOOKUP(H76&I76,Référentiel_pour_Sphinx!C:O,12,FALSE),IF(K76=\"Système Actif Electrique\",VLOOKUP(H76&I76,Référentiel_pour_Sphinx!C:O,13,FALSE),\"\"))),\"\"))","v":""},{"$f":"IF(INDEX(Référentiel_pour_Sphinx!$A$1:$F$235,MATCH(H76,Référentiel_pour_Sphinx!$A$1:$A$235,0),6)=0,\"\",INDEX(Référentiel_pour_Sphinx!$A$1:$F$235,MATCH(H76,Référentiel_pour_Sphinx!$A$1:$A$235,0),6))","v":{"$error":"#N/A"}},"",""]
[null,"Prescription N°70",null,null,null,null,null,null,null,null,null,null,{"$f":"IF(H77=\"\",\"\",IF(OR(I77=\"\",J77=\"\",K77=\"\"),\"Saisie Incomplète\",IF(H77=\"\",\"\",\nIF(OR(H77=\"MEDICAMENT NON INTEGRE AU GUIDE DU ResOMeDIT\",K77=\"Hors liste\"),\"Situation non intégrée dans le guide ResOMeDIT\",\nIF(K77=Liste!$B$2,\"Situation non intégrée dans le guide ResOMeDIT\",\nIF(K77=Liste!$B$3,INDEX(Référentiel_pour_Sphinx!$A$1:$U$235,MATCH((H77&I77&\"_\"&J77),Référentiel_pour_Sphinx!$D$1:$D$235,0),17),\nIF(K77=Liste!$B$4,INDEX(Référentiel_pour_Sphinx!$A$1:$U$235,MATCH((H77&I77&\"_\"&J77),Référentiel_pour_Sphinx!$D$1:$D$235,0),18),\nIF(K77=Liste!$B$5,INDEX(Référentiel_pour_Sphinx!$A$1:$U$235,MATCH((H77&I77&\"_\"&J77),Référentiel_pour_Sphinx!$D$1:$D$235,0),19),IF(K77=\"Non Renseigné\",\"Non conformité : Prescription incomplète\",\"Situation non intégrée dans le guide ResOMeDIT\")\n))))))))","v":""},null,null,{"$f":"IF(H77=\"MEDICAMENT NON INTEGRE AU GUIDE DU ResOMeDIT\",\"\",IF(AND(L77<>\"\",L77<>\"Saisie incomplète\"),VLOOKUP(H77&I77,Référentiel_pour_Sphinx!C:G,5,FALSE),\"\"))","v":""},null,{"$f":"IF(H77=\"MEDICAMENT NON INTEGRE AU GUIDE DU ResOMeDIT\",\"\",IF(AND(L77<>\"\",L77<>\"Saisie incomplète\"),IF(K77=\"Gravité\",VLOOKUP(H77&I77,Référentiel_pour_Sphinx!C:O,11,FALSE),IF(K77=\"Diffuseur\",VLOOKUP(H77&I77,Référentiel_pour_Sphinx!C:O,12,FALSE),IF(K77=\"Système Actif Electrique\",VLOOKUP(H77&I77,Référentiel_pour_Sphinx!C:O,13,FALSE),\"\"))),\"\"))","v":""},{"$f":"IF(INDEX(Référentiel_pour_Sphinx!$A$1:$F$235,MATCH(H77,Référentiel_pour_Sphinx!$A$1:$A$235,0),6)=0,\"\",INDEX(Référentiel_pour_Sphinx!$A$1:$F$235,MATCH(H77,Référentiel_pour_Sphinx!$A$1:$A$235,0),6))","v":{"$error":"#N/A"}},"",""]
[null,"Prescription N°71",null,null,null,null,null,null,null,null,null,null,{"$f":"IF(H78=\"\",\"\",IF(OR(I78=\"\",J78=\"\",K78=\"\"),\"Saisie Incomplète\",IF(H78=\"\",\"\",\nIF(OR(H78=\"MEDICAMENT NON INTEGRE AU GUIDE DU ResOMeDIT\",K78=\"Hors liste\"),\"Situation non intégrée dans le guide ResOMeDIT\",\nIF(K78=Liste!$B$2,\"Situation non intégrée dans le guide ResOMeDIT\",\nIF(K78=Liste!$B$3,INDEX(Référentiel_pour_Sphinx!$A$1:$U$235,MATCH((H78&I78&\"_\"&J78),Référentiel_pour_Sphinx!$D$1:$D$235,0),17),\nIF(K78=Liste!$B$4,INDEX(Référentiel_pour_Sphinx!$A$1:$U$235,MATCH((H78&I78&\"_\"&J78),Référentiel_pour_Sphinx!$D$1:$D$235,0),18),\nIF(K78=Liste!$B$5,INDEX(Référentiel_pour_Sphinx!$A$1:$U$235,MATCH((H78&I78&\"_\"&J78),Référentiel_pour_Sphinx!$D$1:$D$235,0),19),IF(K78=\"Non Renseigné\",\"Non conformité : Prescription incomplète\",\"Situation non intégrée dans le guide ResOMeDIT\")\n))))))))","v":""},null,null,{"$f":"IF(H78=\"MEDICAMENT NON INTEGRE AU GUIDE DU ResOMeDIT\",\"\",IF(AND(L78<>\"\",L78<>\"Saisie incomplète\"),VLOOKUP(H78&I78,Référentiel_pour_Sphinx!C:G,5,FALSE),\"\"))","v":""},null,{"$f":"IF(H78=\"MEDICAMENT NON INTEGRE AU GUIDE DU ResOMeDIT\",\"\",IF(AND(L78<>\"\",L78<>\"Saisie incomplète\"),IF(K78=\"Gravité\",VLOOKUP(H78&I78,Référentiel_pour_Sphinx!C:O,11,FALSE),IF(K78=\"Diffuseur\",VLOOKUP(H78&I78,Référentiel_pour_Sphinx!C:O,12,FALSE),IF(K78=\"Système Actif Electrique\",VLOOKUP(H78&I78,Référentiel_pour_Sphinx!C:O,13,FALSE),\"\"))),\"\"))","v":""},{"$f":"IF(INDEX(Référentiel_pour_Sphinx!$A$1:$F$235,MATCH(H78,Référentiel_pour_Sphinx!$A$1:$A$235,0),6)=0,\"\",INDEX(Référentiel_pour_Sphinx!$A$1:$F$235,MATCH(H78,Référentiel_pour_Sphinx!$A$1:$A$235,0),6))","v":{"$error":"#N/A"}},"",""]
[null,"Prescription N°72",null,null,null,null,null,null,null,null,null,null,{"$f":"IF(H79=\"\",\"\",IF(OR(I79=\"\",J79=\"\",K79=\"\"),\"Saisie Incomplète\",IF(H79=\"\",\"\",\nIF(OR(H79=\"MEDICAMENT NON INTEGRE AU GUIDE DU ResOMeDIT\",K79=\"Hors liste\"),\"Situation non intégrée dans le guide ResOMeDIT\",\nIF(K79=Liste!$B$2,\"Situation non intégrée dans le guide ResOMeDIT\",\nIF(K79=Liste!$B$3,INDEX(Référentiel_pour_Sphinx!$A$1:$U$235,MATCH((H79&I79&\"_\"&J79),Référentiel_pour_Sphinx!$D$1:$D$235,0),17),\nIF(K79=Liste!$B$4,INDEX(Référentiel_pour_Sphinx!$A$1:$U$235,MATCH((H79&I79&\"_\"&J79),Référentiel_pour_Sphinx!$D$1:$D$235,0),18),\nIF(K79=Liste!$B$5,INDEX(Référentiel_pour_Sphinx!$A$1:$U$235,MATCH((H79&I79&\"_\"&J79),Référentiel_pour_Sphinx!$D$1:$D$235,0),19),IF(K79=\"Non Renseigné\",\"Non conformité : Prescription incomplète\",\"Situation non intégrée dans le guide ResOMeDIT\")\n))))))))","v":""},null,null,{"$f":"IF(H79=\"MEDICAMENT NON INTEGRE AU GUIDE DU ResOMeDIT\",\"\",IF(AND(L79<>\"\",L79<>\"Saisie incomplète\"),VLOOKUP(H79&I79,Référentiel_pour_Sphinx!C:G,5,FALSE),\"\"))","v":""},null,{"$f":"IF(H79=\"MEDICAMENT NON INTEGRE AU GUIDE DU ResOMeDIT\",\"\",IF(AND(L79<>\"\",L79<>\"Saisie incomplète\"),IF(K79=\"Gravité\",VLOOKUP(H79&I79,Référentiel_pour_Sphinx!C:O,11,FALSE),IF(K79=\"Diffuseur\",VLOOKUP(H79&I79,Référentiel_pour_Sphinx!C:O,12,FALSE),IF(K79=\"Système Actif Electrique\",VLOOKUP(H79&I79,Référentiel_pour_Sphinx!C:O,13,FALSE),\"\"))),\"\"))","v":""},{"$f":"IF(INDEX(Référentiel_pour_Sphinx!$A$1:$F$235,MATCH(H79,Référentiel_pour_Sphinx!$A$1:$A$235,0),6)=0,\"\",INDEX(Référentiel_pour_Sphinx!$A$1:$F$235,MATCH(H79,Référentiel_pour_Sphinx!$A$1:$A$235,0),6))","v":{"$error":"#N/A"}},"",""]
[null,"Prescription N°73",null,null,null,null,null,null,null,null,null,null,{"$f":"IF(H80=\"\",\"\",IF(OR(I80=\"\",J80=\"\",K80=\"\"),\"Saisie Incomplète\",IF(H80=\"\",\"\",\nIF(OR(H80=\"MEDICAMENT NON INTEGRE AU GUIDE DU ResOMeDIT\",K80=\"Hors liste\"),\"Situation non intégrée dans le guide ResOMeDIT\",\nIF(K80=Liste!$B$2,\"Situation non intégrée dans le guide ResOMeDIT\",\nIF(K80=Liste!$B$3,INDEX(Référentiel_pour_Sphinx!$A$1:$U$235,MATCH((H80&I80&\"_\"&J80),Référentiel_pour_Sphinx!$D$1:$D$235,0),17),\nIF(K80=Liste!$B$4,INDEX(Référentiel_pour_Sphinx!$A$1:$U$235,MATCH((H80&I80&\"_\"&J80),Référentiel_pour_Sphinx!$D$1:$D$235,0),18),\nIF(K80=Liste!$B$5,INDEX(Référentiel_pour_Sphinx!$A$1:$U$235,MATCH((H80&I80&\"_\"&J80),Référentiel_pour_Sphinx!$D$1:$D$235,0),19),IF(K80=\"Non Renseigné\",\"Non conformité : Prescription incomplète\",\"Situation non intégrée dans le guide ResOMeDIT\")\n))))))))","v":""},null,null,{"$f":"IF(H80=\"MEDICAMENT NON INTEGRE AU GUIDE DU ResOMeDIT\",\"\",IF(AND(L80<>\"\",L80<>\"Saisie incomplète\"),VLOOKUP(H80&I80,Référentiel_pour_Sphinx!C:G,5,FALSE),\"\"))","v":""},null,{"$f":"IF(H80=\"MEDICAMENT NON INTEGRE AU GUIDE DU ResOMeDIT\",\"\",IF(AND(L80<>\"\",L80<>\"Saisie incomplète\"),IF(K80=\"Gravité\",VLOOKUP(H80&I80,Référentiel_pour_Sphinx!C:O,11,FALSE),IF(K80=\"Diffuseur\",VLOOKUP(H80&I80,Référentiel_pour_Sphinx!C:O,12,FALSE),IF(K80=\"Système Actif Electrique\",VLOOKUP(H80&I80,Référentiel_pour_Sphinx!C:O,13,FALSE),\"\"))),\"\"))","v":""},{"$f":"IF(INDEX(Référentiel_pour_Sphinx!$A$1:$F$235,MATCH(H80,Référentiel_pour_Sphinx!$A$1:$A$235,0),6)=0,\"\",INDEX(Référentiel_pour_Sphinx!$A$1:$F$235,MATCH(H80,Référentiel_pour_Sphinx!$A$1:$A$235,0),6))","v":{"$error":"#N/A"}},"",""]
[null,"Prescription N°74",null,null,null,null,null,null,null,null,null,null,{"$f":"IF(H81=\"\",\"\",IF(OR(I81=\"\",J81=\"\",K81=\"\"),\"Saisie Incomplète\",IF(H81=\"\",\"\",\nIF(OR(H81=\"MEDICAMENT NON INTEGRE AU GUIDE DU ResOMeDIT\",K81=\"Hors liste\"),\"Situation non intégrée dans le guide ResOMeDIT\",\nIF(K81=Liste!$B$2,\"Situation non intégrée dans le guide ResOMeDIT\",\nIF(K81=Liste!$B$3,INDEX(Référentiel_pour_Sphinx!$A$1:$U$235,MATCH((H81&I81&\"_\"&J81),Référentiel_pour_Sphinx!$D$1:$D$235,0),17),\nIF(K81=Liste!$B$4,INDEX(Référentiel_pour_Sphinx!$A$1:$U$235,MATCH((H81&I81&\"_\"&J81),Référentiel_pour_Sphinx!$D$1:$D$235,0),18),\nIF(K81=Liste!$B$5,INDEX(Référentiel_pour_Sphinx!$A$1:$U$235,MATCH((H81&I81&\"_\"&J81),Référentiel_pour_Sphinx!$D$1:$D$235,0),19),IF(K81=\"Non Renseigné\",\"Non conformité : Prescription incomplète\",\"Situation non intégrée dans le guide ResOMeDIT\")\n))))))))","v":""},null,null,{"$f":"IF(H81=\"MEDICAMENT NON INTEGRE AU GUIDE DU ResOMeDIT\",\"\",IF(AND(L81<>\"\",L81<>\"Saisie incomplète\"),VLOOKUP(H81&I81,Référentiel_pour_Sphinx!C:G,5,FALSE),\"\"))","v":""},null,{"$f":"IF(H81=\"MEDICAMENT NON INTEGRE AU GUIDE DU ResOMeDIT\",\"\",IF(AND(L81<>\"\",L81<>\"Saisie incomplète\"),IF(K81=\"Gravité\",VLOOKUP(H81&I81,Référentiel_pour_Sphinx!C:O,11,FALSE),IF(K81=\"Diffuseur\",VLOOKUP(H81&I81,Référentiel_pour_Sphinx!C:O,12,FALSE),IF(K81=\"Système Actif Electrique\",VLOOKUP(H81&I81,Référentiel_pour_Sphinx!C:O,13,FALSE),\"\"))),\"\"))","v":""},{"$f":"IF(INDEX(Référentiel_pour_Sphinx!$A$1:$F$235,MATCH(H81,Référentiel_pour_Sphinx!$A$1:$A$235,0),6)=0,\"\",INDEX(Référentiel_pour_Sphinx!$A$1:$F$235,MATCH(H81,Référentiel_pour_Sphinx!$A$1:$A$235,0),6))","v":{"$error":"#N/A"}},"",""]
[null,"Prescription N°75",null,null,null,null,null,null,null,null,null,null,{"$f":"IF(H82=\"\",\"\",IF(OR(I82=\"\",J82=\"\",K82=\"\"),\"Saisie Incomplète\",IF(H82=\"\",\"\",\nIF(OR(H82=\"MEDICAMENT NON INTEGRE AU GUIDE DU ResOMeDIT\",K82=\"Hors liste\"),\"Situation non intégrée dans le guide ResOMeDIT\",\nIF(K82=Liste!$B$2,\"Situation non intégrée dans le guide ResOMeDIT\",\nIF(K82=Liste!$B$3,INDEX(Référentiel_pour_Sphinx!$A$1:$U$235,MATCH((H82&I82&\"_\"&J82),Référentiel_pour_Sphinx!$D$1:$D$235,0),17),\nIF(K82=Liste!$B$4,INDEX(Référentiel_pour_Sphinx!$A$1:$U$235,MATCH((H82&I82&\"_\"&J82),Référentiel_pour_Sphinx!$D$1:$D$235,0),18),\nIF(K82=Liste!$B$5,INDEX(Référentiel_pour_Sphinx!$A$1:$U$235,MATCH((H82&I82&\"_\"&J82),Référentiel_pour_Sphinx!$D$1:$D$235,0),19),IF(K82=\"Non Renseigné\",\"Non conformité : Prescription incomplète\",\"Situation non intégrée dans le guide ResOMeDIT\")\n))))))))","v":""},null,null,{"$f":"IF(H82=\"MEDICAMENT NON INTEGRE AU GUIDE DU ResOMeDIT\",\"\",IF(AND(L82<>\"\",L82<>\"Saisie incomplète\"),VLOOKUP(H82&I82,Référentiel_pour_Sphinx!C:G,5,FALSE),\"\"))","v":""},null,{"$f":"IF(H82=\"MEDICAMENT NON INTEGRE AU GUIDE DU ResOMeDIT\",\"\",IF(AND(L82<>\"\",L82<>\"Saisie incomplète\"),IF(K82=\"Gravité\",VLOOKUP(H82&I82,Référentiel_pour_Sphinx!C:O,11,FALSE),IF(K82=\"Diffuseur\",VLOOKUP(H82&I82,Référentiel_pour_Sphinx!C:O,12,FALSE),IF(K82=\"Système Actif Electrique\",VLOOKUP(H82&I82,Référentiel_pour_Sphinx!C:O,13,FALSE),\"\"))),\"\"))","v":""},{"$f":"IF(INDEX(Référentiel_pour_Sphinx!$A$1:$F$235,MATCH(H82,Référentiel_pour_Sphinx!$A$1:$A$235,0),6)=0,\"\",INDEX(Référentiel_pour_Sphinx!$A$1:$F$235,MATCH(H82,Référentiel_pour_Sphinx!$A$1:$A$235,0),6))","v":{"$error":"#N/A"}},"",""]
[null,"Prescription N°76",null,null,null,null,null,null,null,null,null,null,{"$f":"IF(H83=\"\",\"\",IF(OR(I83=\"\",J83=\"\",K83=\"\"),\"Saisie Incomplète\",IF(H83=\"\",\"\",\nIF(OR(H83=\"MEDICAMENT NON INTEGRE AU GUIDE DU ResOMeDIT\",K83=\"Hors liste\"),\"Situation non intégrée dans le guide ResOMeDIT\",\nIF(K83=Liste!$B$2,\"Situation non intégrée dans le guide ResOMeDIT\",\nIF(K83=Liste!$B$3,INDEX(Référentiel_pour_Sphinx!$A$1:$U$235,MATCH((H83&I83&\"_\"&J83),Référentiel_pour_Sphinx!$D$1:$D$235,0),17),\nIF(K83=Liste!$B$4,INDEX(Référentiel_pour_Sphinx!$A$1:$U$235,MATCH((H83&I83&\"_\"&J83),Référentiel_pour_Sphinx!$D$1:$D$235,0),18),\nIF(K83=Liste!$B$5,INDEX(Référentiel_pour_Sphinx!$A$1:$U$235,MATCH((H83&I83&\"_\"&J83),Référentiel_pour_Sphinx!$D$1:$D$235,0),19),IF(K83=\"Non Renseigné\",\"Non conformité : Prescription incomplète\",\"Situation non intégrée dans le guide ResOMeDIT\")\n))))))))","v":""},null,null,{"$f":"IF(H83=\"MEDICAMENT NON INTEGRE AU GUIDE DU ResOMeDIT\",\"\",IF(AND(L83<>\"\",L83<>\"Saisie incomplète\"),VLOOKUP(H83&I83,Référentiel_pour_Sphinx!C:G,5,FALSE),\"\"))","v":""},null,{"$f":"IF(H83=\"MEDICAMENT NON INTEGRE AU GUIDE DU ResOMeDIT\",\"\",IF(AND(L83<>\"\",L83<>\"Saisie incomplète\"),IF(K83=\"Gravité\",VLOOKUP(H83&I83,Référentiel_pour_Sphinx!C:O,11,FALSE),IF(K83=\"Diffuseur\",VLOOKUP(H83&I83,Référentiel_pour_Sphinx!C:O,12,FALSE),IF(K83=\"Système Actif Electrique\",VLOOKUP(H83&I83,Référentiel_pour_Sphinx!C:O,13,FALSE),\"\"))),\"\"))","v":""},{"$f":"IF(INDEX(Référentiel_pour_Sphinx!$A$1:$F$235,MATCH(H83,Référentiel_pour_Sphinx!$A$1:$A$235,0),6)=0,\"\",INDEX(Référentiel_pour_Sphinx!$A$1:$F$235,MATCH(H83,Référentiel_pour_Sphinx!$A$1:$A$235,0),6))","v":{"$error":"#N/A"}},"",""]
[null,"Prescription N°77",null,null,null,null,null,null,null,null,null,null,{"$f":"IF(H84=\"\",\"\",IF(OR(I84=\"\",J84=\"\",K84=\"\"),\"Saisie Incomplète\",IF(H84=\"\",\"\",\nIF(OR(H84=\"MEDICAMENT NON INTEGRE AU GUIDE DU ResOMeDIT\",K84=\"Hors liste\"),\"Situation non intégrée dans le guide ResOMeDIT\",\nIF(K84=Liste!$B$2,\"Situation non intégrée dans le guide ResOMeDIT\",\nIF(K84=Liste!$B$3,INDEX(Référentiel_pour_Sphinx!$A$1:$U$235,MATCH((H84&I84&\"_\"&J84),Référentiel_pour_Sphinx!$D$1:$D$235,0),17),\nIF(K84=Liste!$B$4,INDEX(Référentiel_pour_Sphinx!$A$1:$U$235,MATCH((H84&I84&\"_\"&J84),Référentiel_pour_Sphinx!$D$1:$D$235,0),18),\nIF(K84=Liste!$B$5,INDEX(Référentiel_pour_Sphinx!$A$1:$U$235,MATCH((H84&I84&\"_\"&J84),Référentiel_pour_Sphinx!$D$1:$D$235,0),19),IF(K84=\"Non Renseigné\",\"Non conformité : Prescription incomplète\",\"Situation non intégrée dans le guide ResOMeDIT\")\n))))))))","v":""},null,null,{"$f":"IF(H84=\"MEDICAMENT NON INTEGRE AU GUIDE DU ResOMeDIT\",\"\",IF(AND(L84<>\"\",L84<>\"Saisie incomplète\"),VLOOKUP(H84&I84,Référentiel_pour_Sphinx!C:G,5,FALSE),\"\"))","v":""},null,{"$f":"IF(H84=\"MEDICAMENT NON INTEGRE AU GUIDE DU ResOMeDIT\",\"\",IF(AND(L84<>\"\",L84<>\"Saisie incomplète\"),IF(K84=\"Gravité\",VLOOKUP(H84&I84,Référentiel_pour_Sphinx!C:O,11,FALSE),IF(K84=\"Diffuseur\",VLOOKUP(H84&I84,Référentiel_pour_Sphinx!C:O,12,FALSE),IF(K84=\"Système Actif Electrique\",VLOOKUP(H84&I84,Référentiel_pour_Sphinx!C:O,13,FALSE),\"\"))),\"\"))","v":""},{"$f":"IF(INDEX(Référentiel_pour_Sphinx!$A$1:$F$235,MATCH(H84,Référentiel_pour_Sphinx!$A$1:$A$235,0),6)=0,\"\",INDEX(Référentiel_pour_Sphinx!$A$1:$F$235,MATCH(H84,Référentiel_pour_Sphinx!$A$1:$A$235,0),6))","v":{"$error":"#N/A"}},"",""]
[null,"Prescription N°78",null,null,null,null,null,null,null,null,null,null,{"$f":"IF(H85=\"\",\"\",IF(OR(I85=\"\",J85=\"\",K85=\"\"),\"Saisie Incomplète\",IF(H85=\"\",\"\",\nIF(OR(H85=\"MEDICAMENT NON INTEGRE AU GUIDE DU ResOMeDIT\",K85=\"Hors liste\"),\"Situation non intégrée dans le guide ResOMeDIT\",\nIF(K85=Liste!$B$2,\"Situation non intégrée dans le guide ResOMeDIT\",\nIF(K85=Liste!$B$3,INDEX(Référentiel_pour_Sphinx!$A$1:$U$235,MATCH((H85&I85&\"_\"&J85),Référentiel_pour_Sphinx!$D$1:$D$235,0),17),\nIF(K85=Liste!$B$4,INDEX(Référentiel_pour_Sphinx!$A$1:$U$235,MATCH((H85&I85&\"_\"&J85),Référentiel_pour_Sphinx!$D$1:$D$235,0),18),\nIF(K85=Liste!$B$5,INDEX(Référentiel_pour_Sphinx!$A$1:$U$235,MATCH((H85&I85&\"_\"&J85),Référentiel_pour_Sphinx!$D$1:$D$235,0),19),IF(K85=\"Non Renseigné\",\"Non conformité : Prescription incomplète\",\"Situation non intégrée dans le guide ResOMeDIT\")\n))))))))","v":""},null,null,{"$f":"IF(H85=\"MEDICAMENT NON INTEGRE AU GUIDE DU ResOMeDIT\",\"\",IF(AND(L85<>\"\",L85<>\"Saisie incomplète\"),VLOOKUP(H85&I85,Référentiel_pour_Sphinx!C:G,5,FALSE),\"\"))","v":""},null,{"$f":"IF(H85=\"MEDICAMENT NON INTEGRE AU GUIDE DU ResOMeDIT\",\"\",IF(AND(L85<>\"\",L85<>\"Saisie incomplète\"),IF(K85=\"Gravité\",VLOOKUP(H85&I85,Référentiel_pour_Sphinx!C:O,11,FALSE),IF(K85=\"Diffuseur\",VLOOKUP(H85&I85,Référentiel_pour_Sphinx!C:O,12,FALSE),IF(K85=\"Système Actif Electrique\",VLOOKUP(H85&I85,Référentiel_pour_Sphinx!C:O,13,FALSE),\"\"))),\"\"))","v":""},{"$f":"IF(INDEX(Référentiel_pour_Sphinx!$A$1:$F$235,MATCH(H85,Référentiel_pour_Sphinx!$A$1:$A$235,0),6)=0,\"\",INDEX(Référentiel_pour_Sphinx!$A$1:$F$235,MATCH(H85,Référentiel_pour_Sphinx!$A$1:$A$235,0),6))","v":{"$error":"#N/A"}},"",""]
[null,"Prescription N°79",null,null,null,null,null,null,null,null,null,null,{"$f":"IF(H86=\"\",\"\",IF(OR(I86=\"\",J86=\"\",K86=\"\"),\"Saisie Incomplète\",IF(H86=\"\",\"\",\nIF(OR(H86=\"MEDICAMENT NON INTEGRE AU GUIDE DU ResOMeDIT\",K86=\"Hors liste\"),\"Situation non intégrée dans le guide ResOMeDIT\",\nIF(K86=Liste!$B$2,\"Situation non intégrée dans le guide ResOMeDIT\",\nIF(K86=Liste!$B$3,INDEX(Référentiel_pour_Sphinx!$A$1:$U$235,MATCH((H86&I86&\"_\"&J86),Référentiel_pour_Sphinx!$D$1:$D$235,0),17),\nIF(K86=Liste!$B$4,INDEX(Référentiel_pour_Sphinx!$A$1:$U$235,MATCH((H86&I86&\"_\"&J86),Référentiel_pour_Sphinx!$D$1:$D$235,0),18),\nIF(K86=Liste!$B$5,INDEX(Référentiel_pour_Sphinx!$A$1:$U$235,MATCH((H86&I86&\"_\"&J86),Référentiel_pour_Sphinx!$D$1:$D$235,0),19),IF(K86=\"Non Renseigné\",\"Non conformité : Prescription incomplète\",\"Situation non intégrée dans le guide ResOMeDIT\")\n))))))))","v":""},null,null,{"$f":"IF(H86=\"MEDICAMENT NON INTEGRE AU GUIDE DU ResOMeDIT\",\"\",IF(AND(L86<>\"\",L86<>\"Saisie incomplète\"),VLOOKUP(H86&I86,Référentiel_pour_Sphinx!C:G,5,FALSE),\"\"))","v":""},null,{"$f":"IF(H86=\"MEDICAMENT NON INTEGRE AU GUIDE DU ResOMeDIT\",\"\",IF(AND(L86<>\"\",L86<>\"Saisie incomplète\"),IF(K86=\"Gravité\",VLOOKUP(H86&I86,Référentiel_pour_Sphinx!C:O,11,FALSE),IF(K86=\"Diffuseur\",VLOOKUP(H86&I86,Référentiel_pour_Sphinx!C:O,12,FALSE),IF(K86=\"Système Actif Electrique\",VLOOKUP(H86&I86,Référentiel_pour_Sphinx!C:O,13,FALSE),\"\"))),\"\"))","v":""},{"$f":"IF(INDEX(Référentiel_pour_Sphinx!$A$1:$F$235,MATCH(H86,Référentiel_pour_Sphinx!$A$1:$A$235,0),6)=0,\"\",INDEX(Référentiel_pour_Sphinx!$A$1:$F$235,MATCH(H86,Référentiel_pour_Sphinx!$A$1:$A$235,0),6))","v":{"$error":"#N/A"}},"",""]
[null,"Prescription N°80",null,null,null,null,null,null,null,null,null,null,{"$f":"IF(H87=\"\",\"\",IF(OR(I87=\"\",J87=\"\",K87=\"\"),\"Saisie Incomplète\",IF(H87=\"\",\"\",\nIF(OR(H87=\"MEDICAMENT NON INTEGRE AU GUIDE DU ResOMeDIT\",K87=\"Hors liste\"),\"Situation non intégrée dans le guide ResOMeDIT\",\nIF(K87=Liste!$B$2,\"Situation non intégrée dans le guide ResOMeDIT\",\nIF(K87=Liste!$B$3,INDEX(Référentiel_pour_Sphinx!$A$1:$U$235,MATCH((H87&I87&\"_\"&J87),Référentiel_pour_Sphinx!$D$1:$D$235,0),17),\nIF(K87=Liste!$B$4,INDEX(Référentiel_pour_Sphinx!$A$1:$U$235,MATCH((H87&I87&\"_\"&J87),Référentiel_pour_Sphinx!$D$1:$D$235,0),18),\nIF(K87=Liste!$B$5,INDEX(Référentiel_pour_Sphinx!$A$1:$U$235,MATCH((H87&I87&\"_\"&J87),Référentiel_pour_Sphinx!$D$1:$D$235,0),19),IF(K87=\"Non Renseigné\",\"Non conformité : Prescription incomplète\",\"Situation non intégrée dans le guide ResOMeDIT\")\n))))))))","v":""},null,null,{"$f":"IF(H87=\"MEDICAMENT NON INTEGRE AU GUIDE DU ResOMeDIT\",\"\",IF(AND(L87<>\"\",L87<>\"Saisie incomplète\"),VLOOKUP(H87&I87,Référentiel_pour_Sphinx!C:G,5,FALSE),\"\"))","v":""},null,{"$f":"IF(H87=\"MEDICAMENT NON INTEGRE AU GUIDE DU ResOMeDIT\",\"\",IF(AND(L87<>\"\",L87<>\"Saisie incomplète\"),IF(K87=\"Gravité\",VLOOKUP(H87&I87,Référentiel_pour_Sphinx!C:O,11,FALSE),IF(K87=\"Diffuseur\",VLOOKUP(H87&I87,Référentiel_pour_Sphinx!C:O,12,FALSE),IF(K87=\"Système Actif Electrique\",VLOOKUP(H87&I87,Référentiel_pour_Sphinx!C:O,13,FALSE),\"\"))),\"\"))","v":""},{"$f":"IF(INDEX(Référentiel_pour_Sphinx!$A$1:$F$235,MATCH(H87,Référentiel_pour_Sphinx!$A$1:$A$235,0),6)=0,\"\",INDEX(Référentiel_pour_Sphinx!$A$1:$F$235,MATCH(H87,Référentiel_pour_Sphinx!$A$1:$A$235,0),6))","v":{"$error":"#N/A"}},"",""]
[null,"Prescription N°81",null,null,null,null,null,null,null,null,null,null,{"$f":"IF(H88=\"\",\"\",IF(OR(I88=\"\",J88=\"\",K88=\"\"),\"Saisie Incomplète\",IF(H88=\"\",\"\",\nIF(OR(H88=\"MEDICAMENT NON INTEGRE AU GUIDE DU ResOMeDIT\",K88=\"Hors liste\"),\"Situation non intégrée dans le guide ResOMeDIT\",\nIF(K88=Liste!$B$2,\"Situation non intégrée dans le guide ResOMeDIT\",\nIF(K88=Liste!$B$3,INDEX(Référentiel_pour_Sphinx!$A$1:$U$235,MATCH((H88&I88&\"_\"&J88),Référentiel_pour_Sphinx!$D$1:$D$235,0),17),\nIF(K88=Liste!$B$4,INDEX(Référentiel_pour_Sphinx!$A$1:$U$235,MATCH((H88&I88&\"_\"&J88),Référentiel_pour_Sphinx!$D$1:$D$235,0),18),\nIF(K88=Liste!$B$5,INDEX(Référentiel_pour_Sphinx!$A$1:$U$235,MATCH((H88&I88&\"_\"&J88),Référentiel_pour_Sphinx!$D$1:$D$235,0),19),IF(K88=\"Non Renseigné\",\"Non conformité : Prescription incomplète\",\"Situation non intégrée dans le guide ResOMeDIT\")\n))))))))","v":""},null,null,{"$f":"IF(H88=\"MEDICAMENT NON INTEGRE AU GUIDE DU ResOMeDIT\",\"\",IF(AND(L88<>\"\",L88<>\"Saisie incomplète\"),VLOOKUP(H88&I88,Référentiel_pour_Sphinx!C:G,5,FALSE),\"\"))","v":""},null,{"$f":"IF(H88=\"MEDICAMENT NON INTEGRE AU GUIDE DU ResOMeDIT\",\"\",IF(AND(L88<>\"\",L88<>\"Saisie incomplète\"),IF(K88=\"Gravité\",VLOOKUP(H88&I88,Référentiel_pour_Sphinx!C:O,11,FALSE),IF(K88=\"Diffuseur\",VLOOKUP(H88&I88,Référentiel_pour_Sphinx!C:O,12,FALSE),IF(K88=\"Système Actif Electrique\",VLOOKUP(H88&I88,Référentiel_pour_Sphinx!C:O,13,FALSE),\"\"))),\"\"))","v":""},{"$f":"IF(INDEX(Référentiel_pour_Sphinx!$A$1:$F$235,MATCH(H88,Référentiel_pour_Sphinx!$A$1:$A$235,0),6)=0,\"\",INDEX(Référentiel_pour_Sphinx!$A$1:$F$235,MATCH(H88,Référentiel_pour_Sphinx!$A$1:$A$235,0),6))","v":{"$error":"#N/A"}},"",""]
[null,"Prescription N°82",null,null,null,null,null,null,null,null,null,null,{"$f":"IF(H89=\"\",\"\",IF(OR(I89=\"\",J89=\"\",K89=\"\"),\"Saisie Incomplète\",IF(H89=\"\",\"\",\nIF(OR(H89=\"MEDICAMENT NON INTEGRE AU GUIDE DU ResOMeDIT\",K89=\"Hors liste\"),\"Situation non intégrée dans le guide ResOMeDIT\",\nIF(K89=Liste!$B$2,\"Situation non intégrée dans le guide ResOMeDIT\",\nIF(K89=Liste!$B$3,INDEX(Référentiel_pour_Sphinx!$A$1:$U$235,MATCH((H89&I89&\"_\"&J89),Référentiel_pour_Sphinx!$D$1:$D$235,0),17),\nIF(K89=Liste!$B$4,INDEX(Référentiel_pour_Sphinx!$A$1:$U$235,MATCH((H89&I89&\"_\"&J89),Référentiel_pour_Sphinx!$D$1:$D$235,0),18),\nIF(K89=Liste!$B$5,INDEX(Référentiel_pour_Sphinx!$A$1:$U$235,MATCH((H89&I89&\"_\"&J89),Référentiel_pour_Sphinx!$D$1:$D$235,0),19),IF(K89=\"Non Renseigné\",\"Non conformité : Prescription incomplète\",\"Situation non intégrée dans le guide ResOMeDIT\")\n))))))))","v":""},null,null,{"$f":"IF(H89=\"MEDICAMENT NON INTEGRE AU GUIDE DU ResOMeDIT\",\"\",IF(AND(L89<>\"\",L89<>\"Saisie incomplète\"),VLOOKUP(H89&I89,Référentiel_pour_Sphinx!C:G,5,FALSE),\"\"))","v":""},null,{"$f":"IF(H89=\"MEDICAMENT NON INTEGRE AU GUIDE DU ResOMeDIT\",\"\",IF(AND(L89<>\"\",L89<>\"Saisie incomplète\"),IF(K89=\"Gravité\",VLOOKUP(H89&I89,Référentiel_pour_Sphinx!C:O,11,FALSE),IF(K89=\"Diffuseur\",VLOOKUP(H89&I89,Référentiel_pour_Sphinx!C:O,12,FALSE),IF(K89=\"Système Actif Electrique\",VLOOKUP(H89&I89,Référentiel_pour_Sphinx!C:O,13,FALSE),\"\"))),\"\"))","v":""},{"$f":"IF(INDEX(Référentiel_pour_Sphinx!$A$1:$F$235,MATCH(H89,Référentiel_pour_Sphinx!$A$1:$A$235,0),6)=0,\"\",INDEX(Référentiel_pour_Sphinx!$A$1:$F$235,MATCH(H89,Référentiel_pour_Sphinx!$A$1:$A$235,0),6))","v":{"$error":"#N/A"}},"",""]
[null,"Prescription N°83",null,null,null,null,null,null,null,null,null,null,{"$f":"IF(H90=\"\",\"\",IF(OR(I90=\"\",J90=\"\",K90=\"\"),\"Saisie Incomplète\",IF(H90=\"\",\"\",\nIF(OR(H90=\"MEDICAMENT NON INTEGRE AU GUIDE DU ResOMeDIT\",K90=\"Hors liste\"),\"Situation non intégrée dans le guide ResOMeDIT\",\nIF(K90=Liste!$B$2,\"Situation non intégrée dans le guide ResOMeDIT\",\nIF(K90=Liste!$B$3,INDEX(Référentiel_pour_Sphinx!$A$1:$U$235,MATCH((H90&I90&\"_\"&J90),Référentiel_pour_Sphinx!$D$1:$D$235,0),17),\nIF(K90=Liste!$B$4,INDEX(Référentiel_pour_Sphinx!$A$1:$U$235,MATCH((H90&I90&\"_\"&J90),Référentiel_pour_Sphinx!$D$1:$D$235,0),18),\nIF(K90=Liste!$B$5,INDEX(Référentiel_pour_Sphinx!$A$1:$U$235,MATCH((H90&I90&\"_\"&J90),Référentiel_pour_Sphinx!$D$1:$D$235,0),19),IF(K90=\"Non Renseigné\",\"Non conformité : Prescription incomplète\",\"Situation non intégrée dans le guide ResOMeDIT\")\n))))))))","v":""},null,null,{"$f":"IF(H90=\"MEDICAMENT NON INTEGRE AU GUIDE DU ResOMeDIT\",\"\",IF(AND(L90<>\"\",L90<>\"Saisie incomplète\"),VLOOKUP(H90&I90,Référentiel_pour_Sphinx!C:G,5,FALSE),\"\"))","v":""},null,{"$f":"IF(H90=\"MEDICAMENT NON INTEGRE AU GUIDE DU ResOMeDIT\",\"\",IF(AND(L90<>\"\",L90<>\"Saisie incomplète\"),IF(K90=\"Gravité\",VLOOKUP(H90&I90,Référentiel_pour_Sphinx!C:O,11,FALSE),IF(K90=\"Diffuseur\",VLOOKUP(H90&I90,Référentiel_pour_Sphinx!C:O,12,FALSE),IF(K90=\"Système Actif Electrique\",VLOOKUP(H90&I90,Référentiel_pour_Sphinx!C:O,13,FALSE),\"\"))),\"\"))","v":""},{"$f":"IF(INDEX(Référentiel_pour_Sphinx!$A$1:$F$235,MATCH(H90,Référentiel_pour_Sphinx!$A$1:$A$235,0),6)=0,\"\",INDEX(Référentiel_pour_Sphinx!$A$1:$F$235,MATCH(H90,Référentiel_pour_Sphinx!$A$1:$A$235,0),6))","v":{"$error":"#N/A"}},"",""]
[null,"Prescription N°84",null,null,null,null,null,null,null,null,null,null,{"$f":"IF(H91=\"\",\"\",IF(OR(I91=\"\",J91=\"\",K91=\"\"),\"Saisie Incomplète\",IF(H91=\"\",\"\",\nIF(OR(H91=\"MEDICAMENT NON INTEGRE AU GUIDE DU ResOMeDIT\",K91=\"Hors liste\"),\"Situation non intégrée dans le guide ResOMeDIT\",\nIF(K91=Liste!$B$2,\"Situation non intégrée dans le guide ResOMeDIT\",\nIF(K91=Liste!$B$3,INDEX(Référentiel_pour_Sphinx!$A$1:$U$235,MATCH((H91&I91&\"_\"&J91),Référentiel_pour_Sphinx!$D$1:$D$235,0),17),\nIF(K91=Liste!$B$4,INDEX(Référentiel_pour_Sphinx!$A$1:$U$235,MATCH((H91&I91&\"_\"&J91),Référentiel_pour_Sphinx!$D$1:$D$235,0),18),\nIF(K91=Liste!$B$5,INDEX(Référentiel_pour_Sphinx!$A$1:$U$235,MATCH((H91&I91&\"_\"&J91),Référentiel_pour_Sphinx!$D$1:$D$235,0),19),IF(K91=\"Non Renseigné\",\"Non conformité : Prescription incomplète\",\"Situation non intégrée dans le guide ResOMeDIT\")\n))))))))","v":""},null,null,{"$f":"IF(H91=\"MEDICAMENT NON INTEGRE AU GUIDE DU ResOMeDIT\",\"\",IF(AND(L91<>\"\",L91<>\"Saisie incomplète\"),VLOOKUP(H91&I91,Référentiel_pour_Sphinx!C:G,5,FALSE),\"\"))","v":""},null,{"$f":"IF(H91=\"MEDICAMENT NON INTEGRE AU GUIDE DU ResOMeDIT\",\"\",IF(AND(L91<>\"\",L91<>\"Saisie incomplète\"),IF(K91=\"Gravité\",VLOOKUP(H91&I91,Référentiel_pour_Sphinx!C:O,11,FALSE),IF(K91=\"Diffuseur\",VLOOKUP(H91&I91,Référentiel_pour_Sphinx!C:O,12,FALSE),IF(K91=\"Système Actif Electrique\",VLOOKUP(H91&I91,Référentiel_pour_Sphinx!C:O,13,FALSE),\"\"))),\"\"))","v":""},{"$f":"IF(INDEX(Référentiel_pour_Sphinx!$A$1:$F$235,MATCH(H91,Référentiel_pour_Sphinx!$A$1:$A$235,0),6)=0,\"\",INDEX(Référentiel_pour_Sphinx!$A$1:$F$235,MATCH(H91,Référentiel_pour_Sphinx!$A$1:$A$235,0),6))","v":{"$error":"#N/A"}},"",""]
[null,"Prescription N°85",null,null,null,null,null,null,null,null,null,null,{"$f":"IF(H92=\"\",\"\",IF(OR(I92=\"\",J92=\"\",K92=\"\"),\"Saisie Incomplète\",IF(H92=\"\",\"\",\nIF(OR(H92=\"MEDICAMENT NON INTEGRE AU GUIDE DU ResOMeDIT\",K92=\"Hors liste\"),\"Situation non intégrée dans le guide ResOMeDIT\",\nIF(K92=Liste!$B$2,\"Situation non intégrée dans le guide ResOMeDIT\",\nIF(K92=Liste!$B$3,INDEX(Référentiel_pour_Sphinx!$A$1:$U$235,MATCH((H92&I92&\"_\"&J92),Référentiel_pour_Sphinx!$D$1:$D$235,0),17),\nIF(K92=Liste!$B$4,INDEX(Référentiel_pour_Sphinx!$A$1:$U$235,MATCH((H92&I92&\"_\"&J92),Référentiel_pour_Sphinx!$D$1:$D$235,0),18),\nIF(K92=Liste!$B$5,INDEX(Référentiel_pour_Sphinx!$A$1:$U$235,MATCH((H92&I92&\"_\"&J92),Référentiel_pour_Sphinx!$D$1:$D$235,0),19),IF(K92=\"Non Renseigné\",\"Non conformité : Prescription incomplète\",\"Situation non intégrée dans le guide ResOMeDIT\")\n))))))))","v":""},null,null,{"$f":"IF(H92=\"MEDICAMENT NON INTEGRE AU GUIDE DU ResOMeDIT\",\"\",IF(AND(L92<>\"\",L92<>\"Saisie incomplète\"),VLOOKUP(H92&I92,Référentiel_pour_Sphinx!C:G,5,FALSE),\"\"))","v":""},null,{"$f":"IF(H92=\"MEDICAMENT NON INTEGRE AU GUIDE DU ResOMeDIT\",\"\",IF(AND(L92<>\"\",L92<>\"Saisie incomplète\"),IF(K92=\"Gravité\",VLOOKUP(H92&I92,Référentiel_pour_Sphinx!C:O,11,FALSE),IF(K92=\"Diffuseur\",VLOOKUP(H92&I92,Référentiel_pour_Sphinx!C:O,12,FALSE),IF(K92=\"Système Actif Electrique\",VLOOKUP(H92&I92,Référentiel_pour_Sphinx!C:O,13,FALSE),\"\"))),\"\"))","v":""},{"$f":"IF(INDEX(Référentiel_pour_Sphinx!$A$1:$F$235,MATCH(H92,Référentiel_pour_Sphinx!$A$1:$A$235,0),6)=0,\"\",INDEX(Référentiel_pour_Sphinx!$A$1:$F$235,MATCH(H92,Référentiel_pour_Sphinx!$A$1:$A$235,0),6))","v":{"$error":"#N/A"}},"",""]
[null,"Prescription N°86",null,null,null,null,null,null,null,null,null,null,{"$f":"IF(H93=\"\",\"\",IF(OR(I93=\"\",J93=\"\",K93=\"\"),\"Saisie Incomplète\",IF(H93=\"\",\"\",\nIF(OR(H93=\"MEDICAMENT NON INTEGRE AU GUIDE DU ResOMeDIT\",K93=\"Hors liste\"),\"Situation non intégrée dans le guide ResOMeDIT\",\nIF(K93=Liste!$B$2,\"Situation non intégrée dans le guide ResOMeDIT\",\nIF(K93=Liste!$B$3,INDEX(Référentiel_pour_Sphinx!$A$1:$U$235,MATCH((H93&I93&\"_\"&J93),Référentiel_pour_Sphinx!$D$1:$D$235,0),17),\nIF(K93=Liste!$B$4,INDEX(Référentiel_pour_Sphinx!$A$1:$U$235,MATCH((H93&I93&\"_\"&J93),Référentiel_pour_Sphinx!$D$1:$D$235,0),18),\nIF(K93=Liste!$B$5,INDEX(Référentiel_pour_Sphinx!$A$1:$U$235,MATCH((H93&I93&\"_\"&J93),Référentiel_pour_Sphinx!$D$1:$D$235,0),19),IF(K93=\"Non Renseigné\",\"Non conformité : Prescription incomplète\",\"Situation non intégrée dans le guide ResOMeDIT\")\n))))))))","v":""},null,null,{"$f":"IF(H93=\"MEDICAMENT NON INTEGRE AU GUIDE DU ResOMeDIT\",\"\",IF(AND(L93<>\"\",L93<>\"Saisie incomplète\"),VLOOKUP(H93&I93,Référentiel_pour_Sphinx!C:G,5,FALSE),\"\"))","v":""},null,{"$f":"IF(H93=\"MEDICAMENT NON INTEGRE AU GUIDE DU ResOMeDIT\",\"\",IF(AND(L93<>\"\",L93<>\"Saisie incomplète\"),IF(K93=\"Gravité\",VLOOKUP(H93&I93,Référentiel_pour_Sphinx!C:O,11,FALSE),IF(K93=\"Diffuseur\",VLOOKUP(H93&I93,Référentiel_pour_Sphinx!C:O,12,FALSE),IF(K93=\"Système Actif Electrique\",VLOOKUP(H93&I93,Référentiel_pour_Sphinx!C:O,13,FALSE),\"\"))),\"\"))","v":""},{"$f":"IF(INDEX(Référentiel_pour_Sphinx!$A$1:$F$235,MATCH(H93,Référentiel_pour_Sphinx!$A$1:$A$235,0),6)=0,\"\",INDEX(Référentiel_pour_Sphinx!$A$1:$F$235,MATCH(H93,Référentiel_pour_Sphinx!$A$1:$A$235,0),6))","v":{"$error":"#N/A"}},"",""]
[null,"Prescription N°87",null,null,null,null,null,null,null,null,null,null,{"$f":"IF(H94=\"\",\"\",IF(OR(I94=\"\",J94=\"\",K94=\"\"),\"Saisie Incomplète\",IF(H94=\"\",\"\",\nIF(OR(H94=\"MEDICAMENT NON INTEGRE AU GUIDE DU ResOMeDIT\",K94=\"Hors liste\"),\"Situation non intégrée dans le guide ResOMeDIT\",\nIF(K94=Liste!$B$2,\"Situation non intégrée dans le guide ResOMeDIT\",\nIF(K94=Liste!$B$3,INDEX(Référentiel_pour_Sphinx!$A$1:$U$235,MATCH((H94&I94&\"_\"&J94),Référentiel_pour_Sphinx!$D$1:$D$235,0),17),\nIF(K94=Liste!$B$4,INDEX(Référentiel_pour_Sphinx!$A$1:$U$235,MATCH((H94&I94&\"_\"&J94),Référentiel_pour_Sphinx!$D$1:$D$235,0),18),\nIF(K94=Liste!$B$5,INDEX(Référentiel_pour_Sphinx!$A$1:$U$235,MATCH((H94&I94&\"_\"&J94),Référentiel_pour_Sphinx!$D$1:$D$235,0),19),IF(K94=\"Non Renseigné\",\"Non conformité : Prescription incomplète\",\"Situation non intégrée dans le guide ResOMeDIT\")\n))))))))","v":""},null,null,{"$f":"IF(H94=\"MEDICAMENT NON INTEGRE AU GUIDE DU ResOMeDIT\",\"\",IF(AND(L94<>\"\",L94<>\"Saisie incomplète\"),VLOOKUP(H94&I94,Référentiel_pour_Sphinx!C:G,5,FALSE),\"\"))","v":""},null,{"$f":"IF(H94=\"MEDICAMENT NON INTEGRE AU GUIDE DU ResOMeDIT\",\"\",IF(AND(L94<>\"\",L94<>\"Saisie incomplète\"),IF(K94=\"Gravité\",VLOOKUP(H94&I94,Référentiel_pour_Sphinx!C:O,11,FALSE),IF(K94=\"Diffuseur\",VLOOKUP(H94&I94,Référentiel_pour_Sphinx!C:O,12,FALSE),IF(K94=\"Système Actif Electrique\",VLOOKUP(H94&I94,Référentiel_pour_Sphinx!C:O,13,FALSE),\"\"))),\"\"))","v":""},{"$f":"IF(INDEX(Référentiel_pour_Sphinx!$A$1:$F$235,MATCH(H94,Référentiel_pour_Sphinx!$A$1:$A$235,0),6)=0,\"\",INDEX(Référentiel_pour_Sphinx!$A$1:$F$235,MATCH(H94,Référentiel_pour_Sphinx!$A$1:$A$235,0),6))","v":{"$error":"#N/A"}},"",""]
[null,"Prescription N°88",null,null,null,null,null,null,null,null,null,null,{"$f":"IF(H95=\"\",\"\",IF(OR(I95=\"\",J95=\"\",K95=\"\"),\"Saisie Incomplète\",IF(H95=\"\",\"\",\nIF(OR(H95=\"MEDICAMENT NON INTEGRE AU GUIDE DU ResOMeDIT\",K95=\"Hors liste\"),\"Situation non intégrée dans le guide ResOMeDIT\",\nIF(K95=Liste!$B$2,\"Situation non intégrée dans le guide ResOMeDIT\",\nIF(K95=Liste!$B$3,INDEX(Référentiel_pour_Sphinx!$A$1:$U$235,MATCH((H95&I95&\"_\"&J95),Référentiel_pour_Sphinx!$D$1:$D$235,0),17),\nIF(K95=Liste!$B$4,INDEX(Référentiel_pour_Sphinx!$A$1:$U$235,MATCH((H95&I95&\"_\"&J95),Référentiel_pour_Sphinx!$D$1:$D$235,0),18),\nIF(K95=Liste!$B$5,INDEX(Référentiel_pour_Sphinx!$A$1:$U$235,MATCH((H95&I95&\"_\"&J95),Référentiel_pour_Sphinx!$D$1:$D$235,0),19),IF(K95=\"Non Renseigné\",\"Non conformité : Prescription incomplète\",\"Situation non intégrée dans le guide ResOMeDIT\")\n))))))))","v":""},null,null,{"$f":"IF(H95=\"MEDICAMENT NON INTEGRE AU GUIDE DU ResOMeDIT\",\"\",IF(AND(L95<>\"\",L95<>\"Saisie incomplète\"),VLOOKUP(H95&I95,Référentiel_pour_Sphinx!C:G,5,FALSE),\"\"))","v":""},null,{"$f":"IF(H95=\"MEDICAMENT NON INTEGRE AU GUIDE DU ResOMeDIT\",\"\",IF(AND(L95<>\"\",L95<>\"Saisie incomplète\"),IF(K95=\"Gravité\",VLOOKUP(H95&I95,Référentiel_pour_Sphinx!C:O,11,FALSE),IF(K95=\"Diffuseur\",VLOOKUP(H95&I95,Référentiel_pour_Sphinx!C:O,12,FALSE),IF(K95=\"Système Actif Electrique\",VLOOKUP(H95&I95,Référentiel_pour_Sphinx!C:O,13,FALSE),\"\"))),\"\"))","v":""},{"$f":"IF(INDEX(Référentiel_pour_Sphinx!$A$1:$F$235,MATCH(H95,Référentiel_pour_Sphinx!$A$1:$A$235,0),6)=0,\"\",INDEX(Référentiel_pour_Sphinx!$A$1:$F$235,MATCH(H95,Référentiel_pour_Sphinx!$A$1:$A$235,0),6))","v":{"$error":"#N/A"}},"",""]
[null,"Prescription N°89",null,null,null,null,null,null,null,null,null,null,{"$f":"IF(H96=\"\",\"\",IF(OR(I96=\"\",J96=\"\",K96=\"\"),\"Saisie Incomplète\",IF(H96=\"\",\"\",\nIF(OR(H96=\"MEDICAMENT NON INTEGRE AU GUIDE DU ResOMeDIT\",K96=\"Hors liste\"),\"Situation non intégrée dans le guide ResOMeDIT\",\nIF(K96=Liste!$B$2,\"Situation non intégrée dans le guide ResOMeDIT\",\nIF(K96=Liste!$B$3,INDEX(Référentiel_pour_Sphinx!$A$1:$U$235,MATCH((H96&I96&\"_\"&J96),Référentiel_pour_Sphinx!$D$1:$D$235,0),17),\nIF(K96=Liste!$B$4,INDEX(Référentiel_pour_Sphinx!$A$1:$U$235,MATCH((H96&I96&\"_\"&J96),Référentiel_pour_Sphinx!$D$1:$D$235,0),18),\nIF(K96=Liste!$B$5,INDEX(Référentiel_pour_Sphinx!$A$1:$U$235,MATCH((H96&I96&\"_\"&J96),Référentiel_pour_Sphinx!$D$1:$D$235,0),19),IF(K96=\"Non Renseigné\",\"Non conformité : Prescription incomplète\",\"Situation non intégrée dans le guide ResOMeDIT\")\n))))))))","v":""},null,null,{"$f":"IF(H96=\"MEDICAMENT NON INTEGRE AU GUIDE DU ResOMeDIT\",\"\",IF(AND(L96<>\"\",L96<>\"Saisie incomplète\"),VLOOKUP(H96&I96,Référentiel_pour_Sphinx!C:G,5,FALSE),\"\"))","v":""},null,{"$f":"IF(H96=\"MEDICAMENT NON INTEGRE AU GUIDE DU ResOMeDIT\",\"\",IF(AND(L96<>\"\",L96<>\"Saisie incomplète\"),IF(K96=\"Gravité\",VLOOKUP(H96&I96,Référentiel_pour_Sphinx!C:O,11,FALSE),IF(K96=\"Diffuseur\",VLOOKUP(H96&I96,Référentiel_pour_Sphinx!C:O,12,FALSE),IF(K96=\"Système Actif Electrique\",VLOOKUP(H96&I96,Référentiel_pour_Sphinx!C:O,13,FALSE),\"\"))),\"\"))","v":""},{"$f":"IF(INDEX(Référentiel_pour_Sphinx!$A$1:$F$235,MATCH(H96,Référentiel_pour_Sphinx!$A$1:$A$235,0),6)=0,\"\",INDEX(Référentiel_pour_Sphinx!$A$1:$F$235,MATCH(H96,Référentiel_pour_Sphinx!$A$1:$A$235,0),6))","v":{"$error":"#N/A"}},"",""]
[null,"Prescription N°90",null,null,null,null,null,null,null,null,null,null,{"$f":"IF(H97=\"\",\"\",IF(OR(I97=\"\",J97=\"\",K97=\"\"),\"Saisie Incomplète\",IF(H97=\"\",\"\",\nIF(OR(H97=\"MEDICAMENT NON INTEGRE AU GUIDE DU ResOMeDIT\",K97=\"Hors liste\"),\"Situation non intégrée dans le guide ResOMeDIT\",\nIF(K97=Liste!$B$2,\"Situation non intégrée dans le guide ResOMeDIT\",\nIF(K97=Liste!$B$3,INDEX(Référentiel_pour_Sphinx!$A$1:$U$235,MATCH((H97&I97&\"_\"&J97),Référentiel_pour_Sphinx!$D$1:$D$235,0),17),\nIF(K97=Liste!$B$4,INDEX(Référentiel_pour_Sphinx!$A$1:$U$235,MATCH((H97&I97&\"_\"&J97),Référentiel_pour_Sphinx!$D$1:$D$235,0),18),\nIF(K97=Liste!$B$5,INDEX(Référentiel_pour_Sphinx!$A$1:$U$235,MATCH((H97&I97&\"_\"&J97),Référentiel_pour_Sphinx!$D$1:$D$235,0),19),IF(K97=\"Non Renseigné\",\"Non conformité : Prescription incomplète\",\"Situation non intégrée dans le guide ResOMeDIT\")\n))))))))","v":""},null,null,{"$f":"IF(H97=\"MEDICAMENT NON INTEGRE AU GUIDE DU ResOMeDIT\",\"\",IF(AND(L97<>\"\",L97<>\"Saisie incomplète\"),VLOOKUP(H97&I97,Référentiel_pour_Sphinx!C:G,5,FALSE),\"\"))","v":""},null,{"$f":"IF(H97=\"MEDICAMENT NON INTEGRE AU GUIDE DU ResOMeDIT\",\"\",IF(AND(L97<>\"\",L97<>\"Saisie incomplète\"),IF(K97=\"Gravité\",VLOOKUP(H97&I97,Référentiel_pour_Sphinx!C:O,11,FALSE),IF(K97=\"Diffuseur\",VLOOKUP(H97&I97,Référentiel_pour_Sphinx!C:O,12,FALSE),IF(K97=\"Système Actif Electrique\",VLOOKUP(H97&I97,Référentiel_pour_Sphinx!C:O,13,FALSE),\"\"))),\"\"))","v":""},{"$f":"IF(INDEX(Référentiel_pour_Sphinx!$A$1:$F$235,MATCH(H97,Référentiel_pour_Sphinx!$A$1:$A$235,0),6)=0,\"\",INDEX(Référentiel_pour_Sphinx!$A$1:$F$235,MATCH(H97,Référentiel_pour_Sphinx!$A$1:$A$235,0),6))","v":{"$error":"#N/A"}},"",""]
[null,"Prescription N°91",null,null,null,null,null,null,null,null,null,null,{"$f":"IF(H98=\"\",\"\",IF(OR(I98=\"\",J98=\"\",K98=\"\"),\"Saisie Incomplète\",IF(H98=\"\",\"\",\nIF(OR(H98=\"MEDICAMENT NON INTEGRE AU GUIDE DU ResOMeDIT\",K98=\"Hors liste\"),\"Situation non intégrée dans le guide ResOMeDIT\",\nIF(K98=Liste!$B$2,\"Situation non intégrée dans le guide ResOMeDIT\",\nIF(K98=Liste!$B$3,INDEX(Référentiel_pour_Sphinx!$A$1:$U$235,MATCH((H98&I98&\"_\"&J98),Référentiel_pour_Sphinx!$D$1:$D$235,0),17),\nIF(K98=Liste!$B$4,INDEX(Référentiel_pour_Sphinx!$A$1:$U$235,MATCH((H98&I98&\"_\"&J98),Référentiel_pour_Sphinx!$D$1:$D$235,0),18),\nIF(K98=Liste!$B$5,INDEX(Référentiel_pour_Sphinx!$A$1:$U$235,MATCH((H98&I98&\"_\"&J98),Référentiel_pour_Sphinx!$D$1:$D$235,0),19),IF(K98=\"Non Renseigné\",\"Non conformité : Prescription incomplète\",\"Situation non intégrée dans le guide ResOMeDIT\")\n))))))))","v":""},null,null,{"$f":"IF(H98=\"MEDICAMENT NON INTEGRE AU GUIDE DU ResOMeDIT\",\"\",IF(AND(L98<>\"\",L98<>\"Saisie incomplète\"),VLOOKUP(H98&I98,Référentiel_pour_Sphinx!C:G,5,FALSE),\"\"))","v":""},null,{"$f":"IF(H98=\"MEDICAMENT NON INTEGRE AU GUIDE DU ResOMeDIT\",\"\",IF(AND(L98<>\"\",L98<>\"Saisie incomplète\"),IF(K98=\"Gravité\",VLOOKUP(H98&I98,Référentiel_pour_Sphinx!C:O,11,FALSE),IF(K98=\"Diffuseur\",VLOOKUP(H98&I98,Référentiel_pour_Sphinx!C:O,12,FALSE),IF(K98=\"Système Actif Electrique\",VLOOKUP(H98&I98,Référentiel_pour_Sphinx!C:O,13,FALSE),\"\"))),\"\"))","v":""},{"$f":"IF(INDEX(Référentiel_pour_Sphinx!$A$1:$F$235,MATCH(H98,Référentiel_pour_Sphinx!$A$1:$A$235,0),6)=0,\"\",INDEX(Référentiel_pour_Sphinx!$A$1:$F$235,MATCH(H98,Référentiel_pour_Sphinx!$A$1:$A$235,0),6))","v":{"$error":"#N/A"}},"",""]
[null,"Prescription N°92",null,null,null,null,null,null,null,null,null,null,{"$f":"IF(H99=\"\",\"\",IF(OR(I99=\"\",J99=\"\",K99=\"\"),\"Saisie Incomplète\",IF(H99=\"\",\"\",\nIF(OR(H99=\"MEDICAMENT NON INTEGRE AU GUIDE DU ResOMeDIT\",K99=\"Hors liste\"),\"Situation non intégrée dans le guide ResOMeDIT\",\nIF(K99=Liste!$B$2,\"Situation non intégrée dans le guide ResOMeDIT\",\nIF(K99=Liste!$B$3,INDEX(Référentiel_pour_Sphinx!$A$1:$U$235,MATCH((H99&I99&\"_\"&J99),Référentiel_pour_Sphinx!$D$1:$D$235,0),17),\nIF(K99=Liste!$B$4,INDEX(Référentiel_pour_Sphinx!$A$1:$U$235,MATCH((H99&I99&\"_\"&J99),Référentiel_pour_Sphinx!$D$1:$D$235,0),18),\nIF(K99=Liste!$B$5,INDEX(Référentiel_pour_Sphinx!$A$1:$U$235,MATCH((H99&I99&\"_\"&J99),Référentiel_pour_Sphinx!$D$1:$D$235,0),19),IF(K99=\"Non Renseigné\",\"Non conformité : Prescription incomplète\",\"Situation non intégrée dans le guide ResOMeDIT\")\n))))))))","v":""},null,null,{"$f":"IF(H99=\"MEDICAMENT NON INTEGRE AU GUIDE DU ResOMeDIT\",\"\",IF(AND(L99<>\"\",L99<>\"Saisie incomplète\"),VLOOKUP(H99&I99,Référentiel_pour_Sphinx!C:G,5,FALSE),\"\"))","v":""},null,{"$f":"IF(H99=\"MEDICAMENT NON INTEGRE AU GUIDE DU ResOMeDIT\",\"\",IF(AND(L99<>\"\",L99<>\"Saisie incomplète\"),IF(K99=\"Gravité\",VLOOKUP(H99&I99,Référentiel_pour_Sphinx!C:O,11,FALSE),IF(K99=\"Diffuseur\",VLOOKUP(H99&I99,Référentiel_pour_Sphinx!C:O,12,FALSE),IF(K99=\"Système Actif Electrique\",VLOOKUP(H99&I99,Référentiel_pour_Sphinx!C:O,13,FALSE),\"\"))),\"\"))","v":""},{"$f":"IF(INDEX(Référentiel_pour_Sphinx!$A$1:$F$235,MATCH(H99,Référentiel_pour_Sphinx!$A$1:$A$235,0),6)=0,\"\",INDEX(Référentiel_pour_Sphinx!$A$1:$F$235,MATCH(H99,Référentiel_pour_Sphinx!$A$1:$A$235,0),6))","v":{"$error":"#N/A"}},"",""]
[null,"Prescription N°93",null,null,null,null,null,null,null,null,null,null,{"$f":"IF(H100=\"\",\"\",IF(OR(I100=\"\",J100=\"\",K100=\"\"),\"Saisie Incomplète\",IF(H100=\"\",\"\",\nIF(OR(H100=\"MEDICAMENT NON INTEGRE AU GUIDE DU ResOMeDIT\",K100=\"Hors liste\"),\"Situation non intégrée dans le guide ResOMeDIT\",\nIF(K100=Liste!$B$2,\"Situation non intégrée dans le guide ResOMeDIT\",\nIF(K100=Liste!$B$3,INDEX(Référentiel_pour_Sphinx!$A$1:$U$235,MATCH((H100&I100&\"_\"&J100),Référentiel_pour_Sphinx!$D$1:$D$235,0),17),\nIF(K100=Liste!$B$4,INDEX(Référentiel_pour_Sphinx!$A$1:$U$235,MATCH((H100&I100&\"_\"&J100),Référentiel_pour_Sphinx!$D$1:$D$235,0),18),\nIF(K100=Liste!$B$5,INDEX(Référentiel_pour_Sphinx!$A$1:$U$235,MATCH((H100&I100&\"_\"&J100),Référentiel_pour_Sphinx!$D$1:$D$235,0),19),IF(K100=\"Non Renseigné\",\"Non conformité : Prescription incomplète\",\"Situation non intégrée dans le guide ResOMeDIT\")\n))))))))","v":""},null,null,{"$f":"IF(H100=\"MEDICAMENT NON INTEGRE AU GUIDE DU ResOMeDIT\",\"\",IF(AND(L100<>\"\",L100<>\"Saisie incomplète\"),VLOOKUP(H100&I100,Référentiel_pour_Sphinx!C:G,5,FALSE),\"\"))","v":""},null,{"$f":"IF(H100=\"MEDICAMENT NON INTEGRE AU GUIDE DU ResOMeDIT\",\"\",IF(AND(L100<>\"\",L100<>\"Saisie incomplète\"),IF(K100=\"Gravité\",VLOOKUP(H100&I100,Référentiel_pour_Sphinx!C:O,11,FALSE),IF(K100=\"Diffuseur\",VLOOKUP(H100&I100,Référentiel_pour_Sphinx!C:O,12,FALSE),IF(K100=\"Système Actif Electrique\",VLOOKUP(H100&I100,Référentiel_pour_Sphinx!C:O,13,FALSE),\"\"))),\"\"))","v":""},{"$f":"IF(INDEX(Référentiel_pour_Sphinx!$A$1:$F$235,MATCH(H100,Référentiel_pour_Sphinx!$A$1:$A$235,0),6)=0,\"\",INDEX(Référentiel_pour_Sphinx!$A$1:$F$235,MATCH(H100,Référentiel_pour_Sphinx!$A$1:$A$235,0),6))","v":{"$error":"#N/A"}},"",""]
[null,"Prescription N°94",null,null,null,null,null,null,null,null,null,null,{"$f":"IF(H101=\"\",\"\",IF(OR(I101=\"\",J101=\"\",K101=\"\"),\"Saisie Incomplète\",IF(H101=\"\",\"\",\nIF(OR(H101=\"MEDICAMENT NON INTEGRE AU GUIDE DU ResOMeDIT\",K101=\"Hors liste\"),\"Situation non intégrée dans le guide ResOMeDIT\",\nIF(K101=Liste!$B$2,\"Situation non intégrée dans le guide ResOMeDIT\",\nIF(K101=Liste!$B$3,INDEX(Référentiel_pour_Sphinx!$A$1:$U$235,MATCH((H101&I101&\"_\"&J101),Référentiel_pour_Sphinx!$D$1:$D$235,0),17),\nIF(K101=Liste!$B$4,INDEX(Référentiel_pour_Sphinx!$A$1:$U$235,MATCH((H101&I101&\"_\"&J101),Référentiel_pour_Sphinx!$D$1:$D$235,0),18),\nIF(K101=Liste!$B$5,INDEX(Référentiel_pour_Sphinx!$A$1:$U$235,MATCH((H101&I101&\"_\"&J101),Référentiel_pour_Sphinx!$D$1:$D$235,0),19),IF(K101=\"Non Renseigné\",\"Non conformité : Prescription incomplète\",\"Situation non intégrée dans le guide ResOMeDIT\")\n))))))))","v":""},null,null,{"$f":"IF(H101=\"MEDICAMENT NON INTEGRE AU GUIDE DU ResOMeDIT\",\"\",IF(AND(L101<>\"\",L101<>\"Saisie incomplète\"),VLOOKUP(H101&I101,Référentiel_pour_Sphinx!C:G,5,FALSE),\"\"))","v":""},null,{"$f":"IF(H101=\"MEDICAMENT NON INTEGRE AU GUIDE DU ResOMeDIT\",\"\",IF(AND(L101<>\"\",L101<>\"Saisie incomplète\"),IF(K101=\"Gravité\",VLOOKUP(H101&I101,Référentiel_pour_Sphinx!C:O,11,FALSE),IF(K101=\"Diffuseur\",VLOOKUP(H101&I101,Référentiel_pour_Sphinx!C:O,12,FALSE),IF(K101=\"Système Actif Electrique\",VLOOKUP(H101&I101,Référentiel_pour_Sphinx!C:O,13,FALSE),\"\"))),\"\"))","v":""},{"$f":"IF(INDEX(Référentiel_pour_Sphinx!$A$1:$F$235,MATCH(H101,Référentiel_pour_Sphinx!$A$1:$A$235,0),6)=0,\"\",INDEX(Référentiel_pour_Sphinx!$A$1:$F$235,MATCH(H101,Référentiel_pour_Sphinx!$A$1:$A$235,0),6))","v":{"$error":"#N/A"}},"",""]
[null,"Prescription N°95",null,null,null,null,null,null,null,null,null,null,{"$f":"IF(H102=\"\",\"\",IF(OR(I102=\"\",J102=\"\",K102=\"\"),\"Saisie Incomplète\",IF(H102=\"\",\"\",\nIF(OR(H102=\"MEDICAMENT NON INTEGRE AU GUIDE DU ResOMeDIT\",K102=\"Hors liste\"),\"Situation non intégrée dans le guide ResOMeDIT\",\nIF(K102=Liste!$B$2,\"Situation non intégrée dans le guide ResOMeDIT\",\nIF(K102=Liste!$B$3,INDEX(Référentiel_pour_Sphinx!$A$1:$U$235,MATCH((H102&I102&\"_\"&J102),Référentiel_pour_Sphinx!$D$1:$D$235,0),17),\nIF(K102=Liste!$B$4,INDEX(Référentiel_pour_Sphinx!$A$1:$U$235,MATCH((H102&I102&\"_\"&J102),Référentiel_pour_Sphinx!$D$1:$D$235,0),18),\nIF(K102=Liste!$B$5,INDEX(Référentiel_pour_Sphinx!$A$1:$U$235,MATCH((H102&I102&\"_\"&J102),Référentiel_pour_Sphinx!$D$1:$D$235,0),19),IF(K102=\"Non Renseigné\",\"Non conformité : Prescription incomplète\",\"Situation non intégrée dans le guide ResOMeDIT\")\n))))))))","v":""},null,null,{"$f":"IF(H102=\"MEDICAMENT NON INTEGRE AU GUIDE DU ResOMeDIT\",\"\",IF(AND(L102<>\"\",L102<>\"Saisie incomplète\"),VLOOKUP(H102&I102,Référentiel_pour_Sphinx!C:G,5,FALSE),\"\"))","v":""},null,{"$f":"IF(H102=\"MEDICAMENT NON INTEGRE AU GUIDE DU ResOMeDIT\",\"\",IF(AND(L102<>\"\",L102<>\"Saisie incomplète\"),IF(K102=\"Gravité\",VLOOKUP(H102&I102,Référentiel_pour_Sphinx!C:O,11,FALSE),IF(K102=\"Diffuseur\",VLOOKUP(H102&I102,Référentiel_pour_Sphinx!C:O,12,FALSE),IF(K102=\"Système Actif Electrique\",VLOOKUP(H102&I102,Référentiel_pour_Sphinx!C:O,13,FALSE),\"\"))),\"\"))","v":""},{"$f":"IF(INDEX(Référentiel_pour_Sphinx!$A$1:$F$235,MATCH(H102,Référentiel_pour_Sphinx!$A$1:$A$235,0),6)=0,\"\",INDEX(Référentiel_pour_Sphinx!$A$1:$F$235,MATCH(H102,Référentiel_pour_Sphinx!$A$1:$A$235,0),6))","v":{"$error":"#N/A"}},"",""]
[null,"Prescription N°96",null,null,null,null,null,null,null,null,null,null,{"$f":"IF(H103=\"\",\"\",IF(OR(I103=\"\",J103=\"\",K103=\"\"),\"Saisie Incomplète\",IF(H103=\"\",\"\",\nIF(OR(H103=\"MEDICAMENT NON INTEGRE AU GUIDE DU ResOMeDIT\",K103=\"Hors liste\"),\"Situation non intégrée dans le guide ResOMeDIT\",\nIF(K103=Liste!$B$2,\"Situation non intégrée dans le guide ResOMeDIT\",\nIF(K103=Liste!$B$3,INDEX(Référentiel_pour_Sphinx!$A$1:$U$235,MATCH((H103&I103&\"_\"&J103),Référentiel_pour_Sphinx!$D$1:$D$235,0),17),\nIF(K103=Liste!$B$4,INDEX(Référentiel_pour_Sphinx!$A$1:$U$235,MATCH((H103&I103&\"_\"&J103),Référentiel_pour_Sphinx!$D$1:$D$235,0),18),\nIF(K103=Liste!$B$5,INDEX(Référentiel_pour_Sphinx!$A$1:$U$235,MATCH((H103&I103&\"_\"&J103),Référentiel_pour_Sphinx!$D$1:$D$235,0),19),IF(K103=\"Non Renseigné\",\"Non conformité : Prescription incomplète\",\"Situation non intégrée dans le guide ResOMeDIT\")\n))))))))","v":""},null,null,{"$f":"IF(H103=\"MEDICAMENT NON INTEGRE AU GUIDE DU ResOMeDIT\",\"\",IF(AND(L103<>\"\",L103<>\"Saisie incomplète\"),VLOOKUP(H103&I103,Référentiel_pour_Sphinx!C:G,5,FALSE),\"\"))","v":""},null,{"$f":"IF(H103=\"MEDICAMENT NON INTEGRE AU GUIDE DU ResOMeDIT\",\"\",IF(AND(L103<>\"\",L103<>\"Saisie incomplète\"),IF(K103=\"Gravité\",VLOOKUP(H103&I103,Référentiel_pour_Sphinx!C:O,11,FALSE),IF(K103=\"Diffuseur\",VLOOKUP(H103&I103,Référentiel_pour_Sphinx!C:O,12,FALSE),IF(K103=\"Système Actif Electrique\",VLOOKUP(H103&I103,Référentiel_pour_Sphinx!C:O,13,FALSE),\"\"))),\"\"))","v":""},{"$f":"IF(INDEX(Référentiel_pour_Sphinx!$A$1:$F$235,MATCH(H103,Référentiel_pour_Sphinx!$A$1:$A$235,0),6)=0,\"\",INDEX(Référentiel_pour_Sphinx!$A$1:$F$235,MATCH(H103,Référentiel_pour_Sphinx!$A$1:$A$235,0),6))","v":{"$error":"#N/A"}},"",""]
[null,"Prescription N°97",null,null,null,null,null,null,null,null,null,null,{"$f":"IF(H104=\"\",\"\",IF(OR(I104=\"\",J104=\"\",K104=\"\"),\"Saisie Incomplète\",IF(H104=\"\",\"\",\nIF(OR(H104=\"MEDICAMENT NON INTEGRE AU GUIDE DU ResOMeDIT\",K104=\"Hors liste\"),\"Situation non intégrée dans le guide ResOMeDIT\",\nIF(K104=Liste!$B$2,\"Situation non intégrée dans le guide ResOMeDIT\",\nIF(K104=Liste!$B$3,INDEX(Référentiel_pour_Sphinx!$A$1:$U$235,MATCH((H104&I104&\"_\"&J104),Référentiel_pour_Sphinx!$D$1:$D$235,0),17),\nIF(K104=Liste!$B$4,INDEX(Référentiel_pour_Sphinx!$A$1:$U$235,MATCH((H104&I104&\"_\"&J104),Référentiel_pour_Sphinx!$D$1:$D$235,0),18),\nIF(K104=Liste!$B$5,INDEX(Référentiel_pour_Sphinx!$A$1:$U$235,MATCH((H104&I104&\"_\"&J104),Référentiel_pour_Sphinx!$D$1:$D$235,0),19),IF(K104=\"Non Renseigné\",\"Non conformité : Prescription incomplète\",\"Situation non intégrée dans le guide ResOMeDIT\")\n))))))))","v":""},null,null,{"$f":"IF(H104=\"MEDICAMENT NON INTEGRE AU GUIDE DU ResOMeDIT\",\"\",IF(AND(L104<>\"\",L104<>\"Saisie incomplète\"),VLOOKUP(H104&I104,Référentiel_pour_Sphinx!C:G,5,FALSE),\"\"))","v":""},null,{"$f":"IF(H104=\"MEDICAMENT NON INTEGRE AU GUIDE DU ResOMeDIT\",\"\",IF(AND(L104<>\"\",L104<>\"Saisie incomplète\"),IF(K104=\"Gravité\",VLOOKUP(H104&I104,Référentiel_pour_Sphinx!C:O,11,FALSE),IF(K104=\"Diffuseur\",VLOOKUP(H104&I104,Référentiel_pour_Sphinx!C:O,12,FALSE),IF(K104=\"Système Actif Electrique\",VLOOKUP(H104&I104,Référentiel_pour_Sphinx!C:O,13,FALSE),\"\"))),\"\"))","v":""},{"$f":"IF(INDEX(Référentiel_pour_Sphinx!$A$1:$F$235,MATCH(H104,Référentiel_pour_Sphinx!$A$1:$A$235,0),6)=0,\"\",INDEX(Référentiel_pour_Sphinx!$A$1:$F$235,MATCH(H104,Référentiel_pour_Sphinx!$A$1:$A$235,0),6))","v":{"$error":"#N/A"}},"",""]
[null,"Prescription N°98",null,null,null,null,null,null,null,null,null,null,{"$f":"IF(H105=\"\",\"\",IF(OR(I105=\"\",J105=\"\",K105=\"\"),\"Saisie Incomplète\",IF(H105=\"\",\"\",\nIF(OR(H105=\"MEDICAMENT NON INTEGRE AU GUIDE DU ResOMeDIT\",K105=\"Hors liste\"),\"Situation non intégrée dans le guide ResOMeDIT\",\nIF(K105=Liste!$B$2,\"Situation non intégrée dans le guide ResOMeDIT\",\nIF(K105=Liste!$B$3,INDEX(Référentiel_pour_Sphinx!$A$1:$U$235,MATCH((H105&I105&\"_\"&J105),Référentiel_pour_Sphinx!$D$1:$D$235,0),17),\nIF(K105=Liste!$B$4,INDEX(Référentiel_pour_Sphinx!$A$1:$U$235,MATCH((H105&I105&\"_\"&J105),Référentiel_pour_Sphinx!$D$1:$D$235,0),18),\nIF(K105=Liste!$B$5,INDEX(Référentiel_pour_Sphinx!$A$1:$U$235,MATCH((H105&I105&\"_\"&J105),Référentiel_pour_Sphinx!$D$1:$D$235,0),19),IF(K105=\"Non Renseigné\",\"Non conformité : Prescription incomplète\",\"Situation non intégrée dans le guide ResOMeDIT\")\n))))))))","v":""},null,null,{"$f":"IF(H105=\"MEDICAMENT NON INTEGRE AU GUIDE DU ResOMeDIT\",\"\",IF(AND(L105<>\"\",L105<>\"Saisie incomplète\"),VLOOKUP(H105&I105,Référentiel_pour_Sphinx!C:G,5,FALSE),\"\"))","v":""},null,{"$f":"IF(H105=\"MEDICAMENT NON INTEGRE AU GUIDE DU ResOMeDIT\",\"\",IF(AND(L105<>\"\",L105<>\"Saisie incomplète\"),IF(K105=\"Gravité\",VLOOKUP(H105&I105,Référentiel_pour_Sphinx!C:O,11,FALSE),IF(K105=\"Diffuseur\",VLOOKUP(H105&I105,Référentiel_pour_Sphinx!C:O,12,FALSE),IF(K105=\"Système Actif Electrique\",VLOOKUP(H105&I105,Référentiel_pour_Sphinx!C:O,13,FALSE),\"\"))),\"\"))","v":""},{"$f":"IF(INDEX(Référentiel_pour_Sphinx!$A$1:$F$235,MATCH(H105,Référentiel_pour_Sphinx!$A$1:$A$235,0),6)=0,\"\",INDEX(Référentiel_pour_Sphinx!$A$1:$F$235,MATCH(H105,Référentiel_pour_Sphinx!$A$1:$A$235,0),6))","v":{"$error":"#N/A"}},"",""]
[null,"Prescription N°99",null,null,null,null,null,null,null,null,null,null,{"$f":"IF(H106=\"\",\"\",IF(OR(I106=\"\",J106=\"\",K106=\"\"),\"Saisie Incomplète\",IF(H106=\"\",\"\",\nIF(OR(H106=\"MEDICAMENT NON INTEGRE AU GUIDE DU ResOMeDIT\",K106=\"Hors liste\"),\"Situation non intégrée dans le guide ResOMeDIT\",\nIF(K106=Liste!$B$2,\"Situation non intégrée dans le guide ResOMeDIT\",\nIF(K106=Liste!$B$3,INDEX(Référentiel_pour_Sphinx!$A$1:$U$235,MATCH((H106&I106&\"_\"&J106),Référentiel_pour_Sphinx!$D$1:$D$235,0),17),\nIF(K106=Liste!$B$4,INDEX(Référentiel_pour_Sphinx!$A$1:$U$235,MATCH((H106&I106&\"_\"&J106),Référentiel_pour_Sphinx!$D$1:$D$235,0),18),\nIF(K106=Liste!$B$5,INDEX(Référentiel_pour_Sphinx!$A$1:$U$235,MATCH((H106&I106&\"_\"&J106),Référentiel_pour_Sphinx!$D$1:$D$235,0),19),IF(K106=\"Non Renseigné\",\"Non conformité : Prescription incomplète\",\"Situation non intégrée dans le guide ResOMeDIT\")\n))))))))","v":""},null,null,{"$f":"IF(H106=\"MEDICAMENT NON INTEGRE AU GUIDE DU ResOMeDIT\",\"\",IF(AND(L106<>\"\",L106<>\"Saisie incomplète\"),VLOOKUP(H106&I106,Référentiel_pour_Sphinx!C:G,5,FALSE),\"\"))","v":""},null,{"$f":"IF(H106=\"MEDICAMENT NON INTEGRE AU GUIDE DU ResOMeDIT\",\"\",IF(AND(L106<>\"\",L106<>\"Saisie incomplète\"),IF(K106=\"Gravité\",VLOOKUP(H106&I106,Référentiel_pour_Sphinx!C:O,11,FALSE),IF(K106=\"Diffuseur\",VLOOKUP(H106&I106,Référentiel_pour_Sphinx!C:O,12,FALSE),IF(K106=\"Système Actif Electrique\",VLOOKUP(H106&I106,Référentiel_pour_Sphinx!C:O,13,FALSE),\"\"))),\"\"))","v":""},{"$f":"IF(INDEX(Référentiel_pour_Sphinx!$A$1:$F$235,MATCH(H106,Référentiel_pour_Sphinx!$A$1:$A$235,0),6)=0,\"\",INDEX(Référentiel_pour_Sphinx!$A$1:$F$235,MATCH(H106,Référentiel_pour_Sphinx!$A$1:$A$235,0),6))","v":{"$error":"#N/A"}},"",""]
[null,"Prescription N°100",null,null,null,null,null,null,null,null,null,null,{"$f":"IF(H107=\"\",\"\",IF(OR(I107=\"\",J107=\"\",K107=\"\"),\"Saisie Incomplète\",IF(H107=\"\",\"\",\nIF(OR(H107=\"MEDICAMENT NON INTEGRE AU GUIDE DU ResOMeDIT\",K107=\"Hors liste\"),\"Situation non intégrée dans le guide ResOMeDIT\",\nIF(K107=Liste!$B$2,\"Situation non intégrée dans le guide ResOMeDIT\",\nIF(K107=Liste!$B$3,INDEX(Référentiel_pour_Sphinx!$A$1:$U$235,MATCH((H107&I107&\"_\"&J107),Référentiel_pour_Sphinx!$D$1:$D$235,0),17),\nIF(K107=Liste!$B$4,INDEX(Référentiel_pour_Sphinx!$A$1:$U$235,MATCH((H107&I107&\"_\"&J107),Référentiel_pour_Sphinx!$D$1:$D$235,0),18),\nIF(K107=Liste!$B$5,INDEX(Référentiel_pour_Sphinx!$A$1:$U$235,MATCH((H107&I107&\"_\"&J107),Référentiel_pour_Sphinx!$D$1:$D$235,0),19),IF(K107=\"Non Renseigné\",\"Non conformité : Prescription incomplète\",\"Situation non intégrée dans le guide ResOMeDIT\")\n))))))))","v":""},null,null,{"$f":"IF(H107=\"MEDICAMENT NON INTEGRE AU GUIDE DU ResOMeDIT\",\"\",IF(AND(L107<>\"\",L107<>\"Saisie incomplète\"),VLOOKUP(H107&I107,Référentiel_pour_Sphinx!C:G,5,FALSE),\"\"))","v":""},null,{"$f":"IF(H107=\"MEDICAMENT NON INTEGRE AU GUIDE DU ResOMeDIT\",\"\",IF(AND(L107<>\"\",L107<>\"Saisie incomplète\"),IF(K107=\"Gravité\",VLOOKUP(H107&I107,Référentiel_pour_Sphinx!C:O,11,FALSE),IF(K107=\"Diffuseur\",VLOOKUP(H107&I107,Référentiel_pour_Sphinx!C:O,12,FALSE),IF(K107=\"Système Actif Electrique\",VLOOKUP(H107&I107,Référentiel_pour_Sphinx!C:O,13,FALSE),\"\"))),\"\"))","v":""},{"$f":"IF(INDEX(Référentiel_pour_Sphinx!$A$1:$F$235,MATCH(H107,Référentiel_pour_Sphinx!$A$1:$A$235,0),6)=0,\"\",INDEX(Référentiel_pour_Sphinx!$A$1:$F$235,MATCH(H107,Référentiel_pour_Sphinx!$A$1:$A$235,0),6))","v":{"$error":"#N/A"}},"",""]

{"sheet":"4 - Résultats","index":5,"n_rows":37,"n_cols":17,"rows_kept":37,"cut":false,"hidden":false,"merged":[]}
[]
[null,null,{"$f":"'2 - Identifiez-vous'!A15","v":0}]
[null,null,"Date de l'audit",null,{"$f":"'2 - Identifiez-vous'!A24","v":0}]
[]
[]
[]
[]
[]
[]
[]
[]
[]
[]
[]
[]
[]
[null,"Vous avez 0 saisies incomplètes",null,null,null,null,null,null,null,null,null,null,"Vous avez saisi 0 prescriptions incomplètes"]
[null,"  Dont 0 modes de perfusion non saisis",null,null,null,null,null,null,null,null,null,null,"  Dont 0 doses non renseignées (Conformité déterminée pour 0 lignes)"]
[null,"  Dont 0 doses non saisies",null,null,null,null,null,null,null,null,null,null,"  Dont 0 modes de perfusion non renseignés"]
[null,"Vous avez 0 supports de prescription non saisis",null,null,null,null,null,null,null,null,null,null,"Vous avez 0 prescriptions non intégrée dans le guide RESOMEDIT"]
[]
[]
[]
[null,null,null,null,null,null,null,null,null,null,null,null,null,"Taux de Non-Conformité les plus élevés"]
[null,null,null,null,null,null,null,null,null,null,null,null,"Classe ATC","DCI","Taux de non-conformité","Effectifs non-conformes","Nombre de saisies"]
[null,null,null,null,null,null,null,null,null,null,null,null,{"$f":"IFERROR(INDEX('5 - Conformité par DCI'!$A$2:$I$39,MATCH(N26,'5 - Conformité par DCI'!$B$2:$B$39,0),MATCH($M$25,'5 - Conformité par DCI'!$A$1:$I$1,0)),\"\")","v":""},{"$f":"IFERROR(INDEX(Calcul!$W$2:$X$39,MATCH(SMALL(Calcul!$X$2:$X$39,1),Calcul!$X$2:$X$39,0),1),\"\")","v":""},{"$f":"IFERROR(INDEX('5 - Conformité par DCI'!$A$2:$I$39,MATCH(N26,'5 - Conformité par DCI'!$B$2:$B$39,0),MATCH(Liste!$D$6,'5 - Conformité par DCI'!$A$1:$I$1,0)),\"\")","v":""},{"$f":"IF(COUNTIFS('3 - Saisie'!$H$8:$H$106,'4 - Résultats'!N26,'3 - Saisie'!$L$8:$L$106,Liste!$D$6)=0,\"\",COUNTIFS('3 - Saisie'!$H$8:$H$106,'4 - Résultats'!N26,'3 - Saisie'!$L$8:$L$106,Liste!$D$6))","v":""},{"$f":"IFERROR(INDEX('5 - Conformité par DCI'!$A$2:$I$39,MATCH(N26,'5 - Conformité par DCI'!$B$2:$B$39,0),MATCH('5 - Conformité par DCI'!$C$1,'5 - Conformité par DCI'!$A$1:$I$1,0)),\"\")","v":""}]
[null,null,null,null,null,null,null,null,null,null,null,null,{"$f":"IFERROR(INDEX('5 - Conformité par DCI'!$A$2:$I$39,MATCH(N27,'5 - Conformité par DCI'!$B$2:$B$39,0),MATCH($M$25,'5 - Conformité par DCI'!$A$1:$I$1,0)),\"\")","v":""},{"$f":"IFERROR(INDEX(Calcul!$W$2:$X$39,MATCH(SMALL(Calcul!$X$2:$X$39,2),Calcul!$X$2:$X$39,0),1),\"\")","v":""},{"$f":"IFERROR(INDEX('5 - Conformité par DCI'!$A$2:$I$39,MATCH(N27,'5 - Conformité par DCI'!$B$2:$B$39,0),MATCH(Liste!$D$6,'5 - Conformité par DCI'!$A$1:$I$1,0)),\"\")","v":""},{"$f":"IF(COUNTIFS('3 - Saisie'!$H$8:$H$106,'4 - Résultats'!N27,'3 - Saisie'!$L$8:$L$106,Liste!$D$6)=0,\"\",COUNTIFS('3 - Saisie'!$H$8:$H$106,'4 - Résultats'!N27,'3 - Saisie'!$L$8:$L$106,Liste!$D$6))","v":""},{"$f":"IFERROR(INDEX('5 - Conformité par DCI'!$A$2:$I$39,MATCH(N27,'5 - Conformité par DCI'!$B$2:$B$39,0),MATCH('5 - Conformité par DCI'!$C$1,'5 - Conformité par DCI'!$A$1:$I$1,0)),\"\")","v":""}]
[null,null,null,null,null,null,null,null,null,null,null,null,{"$f":"IFERROR(INDEX('5 - Conformité par DCI'!$A$2:$I$39,MATCH(N28,'5 - Conformité par DCI'!$B$2:$B$39,0),MATCH($M$25,'5 - Conformité par DCI'!$A$1:$I$1,0)),\"\")","v":""},{"$f":"IFERROR(INDEX(Calcul!$W$2:$X$39,MATCH(SMALL(Calcul!$X$2:$X$39,3),Calcul!$X$2:$X$39,0),1),\"\")","v":""},{"$f":"IFERROR(INDEX('5 - Conformité par DCI'!$A$2:$I$39,MATCH(N28,'5 - Conformité par DCI'!$B$2:$B$39,0),MATCH(Liste!$D$6,'5 - Conformité par DCI'!$A$1:$I$1,0)),\"\")","v":""},{"$f":"IF(COUNTIFS('3 - Saisie'!$H$8:$H$106,'4 - Résultats'!N28,'3 - Saisie'!$L$8:$L$106,Liste!$D$6)=0,\"\",COUNTIFS('3 - Saisie'!$H$8:$H$106,'4 - Résultats'!N28,'3 - Saisie'!$L$8:$L$106,Liste!$D$6))","v":""},{"$f":"IFERROR(INDEX('5 - Conformité par DCI'!$A$2:$I$39,MATCH(N28,'5 - Conformité par DCI'!$B$2:$B$39,0),MATCH('5 - Conformité par DCI'!$C$1,'5 - Conformité par DCI'!$A$1:$I$1,0)),\"\")","v":""}]
[null,null,null,null,null,null,null,null,null,null,null,null,{"$f":"IFERROR(INDEX('5 - Conformité par DCI'!$A$2:$I$39,MATCH(N29,'5 - Conformité par DCI'!$B$2:$B$39,0),MATCH($M$25,'5 - Conformité par DCI'!$A$1:$I$1,0)),\"\")","v":""},{"$f":"IFERROR(INDEX(Calcul!$W$2:$X$39,MATCH(SMALL(Calcul!$X$2:$X$39,4),Calcul!$X$2:$X$39,0),1),\"\")","v":""},{"$f":"IFERROR(INDEX('5 - Conformité par DCI'!$A$2:$I$39,MATCH(N29,'5 - Conformité par DCI'!$B$2:$B$39,0),MATCH(Liste!$D$6,'5 - Conformité par DCI'!$A$1:$I$1,0)),\"\")","v":""},{"$f":"IF(COUNTIFS('3 - Saisie'!$H$8:$H$106,'4 - Résultats'!N29,'3 - Saisie'!$L$8:$L$106,Liste!$D$6)=0,\"\",COUNTIFS('3 - Saisie'!$H$8:$H$106,'4 - Résultats'!N29,'3 - Saisie'!$L$8:$L$106,Liste!$D$6))","v":""},{"$f":"IFERROR(INDEX('5 - Conformité par DCI'!$A$2:$I$39,MATCH(N29,'5 - Conformité par DCI'!$B$2:$B$39,0),MATCH('5 - Conformité par DCI'!$C$1,'5 - Conformité par DCI'!$A$1:$I$1,0)),\"\")","v":""}]
[null,null,null,null,null,null,null,null,null,null,null,null,{"$f":"IFERROR(INDEX('5 - Conformité par DCI'!$A$2:$I$39,MATCH(N30,'5 - Conformité par DCI'!$B$2:$B$39,0),MATCH($M$25,'5 - Conformité par DCI'!$A$1:$I$1,0)),\"\")","v":""},{"$f":"IFERROR(INDEX(Calcul!$W$2:$X$39,MATCH(SMALL(Calcul!$X$2:$X$39,5),Calcul!$X$2:$X$39,0),1),\"\")","v":""},{"$f":"IFERROR(INDEX('5 - Conformité par DCI'!$A$2:$I$39,MATCH(N30,'5 - Conformité par DCI'!$B$2:$B$39,0),MATCH(Liste!$D$6,'5 - Conformité par DCI'!$A$1:$I$1,0)),\"\")","v":""},{"$f":"IF(COUNTIFS('3 - Saisie'!$H$8:$H$106,'4 - Résultats'!N30,'3 - Saisie'!$L$8:$L$106,Liste!$D$6)=0,\"\",COUNTIFS('3 - Saisie'!$H$8:$H$106,'4 - Résultats'!N30,'3 - Saisie'!$L$8:$L$106,Liste!$D$6))","v":""},{"$f":"IFERROR(INDEX('5 - Conformité par DCI'!$A$2:$I$39,MATCH(N30,'5 - Conformité par DCI'!$B$2:$B$39,0),MATCH('5 - Conformité par DCI'!$C$1,'5 - Conformité par DCI'!$A$1:$I$1,0)),\"\")","v":""}]
[]
[]
[]
[]
[null,null,"Votre effectif de support issu du DPI est de 0 saisie(s)"]
[null,null,"Votre effectif de support tapé à l'ordinateur est de 0 saisie(s)"]
[null,null,"Votre effectif de support écrit à la main est de 0 saisie(s)"]

{"sheet":"5 - Conformité par DCI","index":6,"n_rows":39,"n_cols":9,"rows_kept":39,"cut":false,"hidden":false,"merged":[]}
["Classe ATC","DCI","Nombre de saisies",{"$f":"Liste!$D4","v":"Conformité du mode d'administration"},{"$f":"Liste!$D5","v":"Modalité alternative d'administration"},{"$f":"Liste!$D6","v":"Non Conformité du mode d'administration"},{"$f":"Liste!$D7","v":"Non conformité : Prescription incomplète"},{"$f":"Liste!$D8","v":"Situation non intégrée dans le guide ResOMeDIT"},{"$f":"Liste!$D9","v":"Saisie Incomplète"}]
[{"$f":"IFERROR(IF(INDEX(Référentiel_pour_Sphinx!$A$1:$F$235,MATCH(B2,Référentiel_pour_Sphinx!$A$1:$A$235,0),6)=0,\"\",INDEX(Référentiel_pour_Sphinx!$A$1:$F$235,MATCH(B2,Référentiel_pour_Sphinx!$A$1:$A$235,0),6)),\"\")","v":""},{"$f":"IF(TCDDCICONF!A18<>0,TCDDCICONF!A18,\"\")","v":"(vide)"},{"$f":"IFERROR(GETPIVOTDATA(\"Conformité\",TCDDCICONF!$A$15,\"DCI\",B2),\"\")","v":0},{"$f":"IFERROR(IF(GETPIVOTDATA(\"Nombre de Conformité2\",TCDDCICONF!$A$15,\"DCI\",B2,\"Conformité\",$D$1)<>0,GETPIVOTDATA(\"Nombre de Conformité2\",TCDDCICONF!$A$15,\"DCI\",B2,\"Conformité\",$D$1),\"\"),\"\")","v":""},{"$f":"IFERROR(IF(GETPIVOTDATA(\"Nombre de Conformité2\",TCDDCICONF!$A$15,\"DCI\",B2,\"Conformité\",$E$1)<>0,GETPIVOTDATA(\"Nombre de Conformité2\",TCDDCICONF!$A$15,\"DCI\",B2,\"Conformité\",$E$1),\"\"),\"\")","v":""},{"$f":"IFERROR(IF(GETPIVOTDATA(\"Nombre de Conformité2\",TCDDCICONF!$A$15,\"DCI\",B2,\"Conformité\",$F$1)<>0,GETPIVOTDATA(\"Nombre de Conformité2\",TCDDCICONF!$A$15,\"DCI\",B2,\"Conformité\",$F$1),\"\"),\"\")","v":""},{"$f":"IFERROR(IF(GETPIVOTDATA(\"Nombre de Conformité2\",TCDDCICONF!$A$15,\"DCI\",B2,\"Conformité\",$G$1)<>0,GETPIVOTDATA(\"Nombre de Conformité2\",TCDDCICONF!$A$15,\"DCI\",B2,\"Conformité\",$G$1),\"\"),\"\")","v":""},{"$f":"IFERROR(IF(GETPIVOTDATA(\"Nombre de Conformité2\",TCDDCICONF!$A$15,\"DCI\",B2,\"Conformité\",$H$1)<>0,GETPIVOTDATA(\"Nombre de Conformité2\",TCDDCICONF!$A$15,\"DCI\",B2,\"Conformité\",$H$1),\"\"),\"\")","v":""},{"$f":"IFERROR(IF(GETPIVOTDATA(\"Nombre de Conformité2\",TCDDCICONF!$A$15,\"DCI\",B2,\"Conformité\",$I$1)<>0,GETPIVOTDATA(\"Nombre de Conformité2\",TCDDCICONF!$A$15,\"DCI\",B2,\"Conformité\",$I$1),\"\"),\"\")","v":""}]
[{"$f":"IFERROR(IF(INDEX(Référentiel_pour_Sphinx!$A$1:$F$235,MATCH(B3,Référentiel_pour_Sphinx!$A$1:$A$235,0),6)=0,\"\",INDEX(Référentiel_pour_Sphinx!$A$1:$F$235,MATCH(B3,Référentiel_pour_Sphinx!$A$1:$A$235,0),6)),\"\")","v":""},{"$f":"IF(TCDDCICONF!A19<>0,TCDDCICONF!A19,\"\")","v":""},{"$f":"IFERROR(GETPIVOTDATA(\"Conformité\",TCDDCICONF!$A$15,\"DCI\",B3),\"\")","v":""},{"$f":"IFERROR(IF(GETPIVOTDATA(\"Nombre de Conformité2\",TCDDCICONF!$A$15,\"DCI\",B3,\"Conformité\",$D$1)<>0,GETPIVOTDATA(\"Nombre de Conformité2\",TCDDCICONF!$A$15,\"DCI\",B3,\"Conformité\",$D$1),\"\"),\"\")","v":""},{"$f":"IFERROR(IF(GETPIVOTDATA(\"Nombre de Conformité2\",TCDDCICONF!$A$15,\"DCI\",B3,\"Conformité\",$E$1)<>0,GETPIVOTDATA(\"Nombre de Conformité2\",TCDDCICONF!$A$15,\"DCI\",B3,\"Conformité\",$E$1),\"\"),\"\")","v":""},{"$f":"IFERROR(IF(GETPIVOTDATA(\"Nombre de Conformité2\",TCDDCICONF!$A$15,\"DCI\",B3,\"Conformité\",$F$1)<>0,GETPIVOTDATA(\"Nombre de Conformité2\",TCDDCICONF!$A$15,\"DCI\",B3,\"Conformité\",$F$1),\"\"),\"\")","v":""},{"$f":"IFERROR(IF(GETPIVOTDATA(\"Nombre de Conformité2\",TCDDCICONF!$A$15,\"DCI\",B3,\"Conformité\",$G$1)<>0,GETPIVOTDATA(\"Nombre de Conformité2\",TCDDCICONF!$A$15,\"DCI\",B3,\"Conformité\",$G$1),\"\"),\"\")","v":""},{"$f":"IFERROR(IF(GETPIVOTDATA(\"Nombre de Conformité2\",TCDDCICONF!$A$15,\"DCI\",B3,\"Conformité\",$H$1)<>0,GETPIVOTDATA(\"Nombre de Conformité2\",TCDDCICONF!$A$15,\"DCI\",B3,\"Conformité\",$H$1),\"\"),\"\")","v":""},{"$f":"IFERROR(IF(GETPIVOTDATA(\"Nombre de Conformité2\",TCDDCICONF!$A$15,\"DCI\",B3,\"Conformité\",$I$1)<>0,GETPIVOTDATA(\"Nombre de Conformité2\",TCDDCICONF!$A$15,\"DCI\",B3,\"Conformité\",$I$1),\"\"),\"\")","v":""}]
[{"$f":"IFERROR(IF(INDEX(Référentiel_pour_Sphinx!$A$1:$F$235,MATCH(B4,Référentiel_pour_Sphinx!$A$1:$A$235,0),6)=0,\"\",INDEX(Référentiel_pour_Sphinx!$A$1:$F$235,MATCH(B4,Référentiel_pour_Sphinx!$A$1:$A$235,0),6)),\"\")","v":""},{"$f":"IF(TCDDCICONF!A20<>0,TCDDCICONF!A20,\"\")","v":""},{"$f":"IFERROR(GETPIVOTDATA(\"Conformité\",TCDDCICONF!$A$15,\"DCI\",B4),\"\")","v":""},{"$f":"IFERROR(IF(GETPIVOTDATA(\"Nombre de Conformité2\",TCDDCICONF!$A$15,\"DCI\",B4,\"Conformité\",$D$1)<>0,GETPIVOTDATA(\"Nombre de Conformité2\",TCDDCICONF!$A$15,\"DCI\",B4,\"Conformité\",$D$1),\"\"),\"\")","v":""},{"$f":"IFERROR(IF(GETPIVOTDATA(\"Nombre de Conformité2\",TCDDCICONF!$A$15,\"DCI\",B4,\"Conformité\",$E$1)<>0,GETPIVOTDATA(\"Nombre de Conformité2\",TCDDCICONF!$A$15,\"DCI\",B4,\"Conformité\",$E$1),\"\"),\"\")","v":""},{"$f":"IFERROR(IF(GETPIVOTDATA(\"Nombre de Conformité2\",TCDDCICONF!$A$15,\"DCI\",B4,\"Conformité\",$F$1)<>0,GETPIVOTDATA(\"Nombre de Conformité2\",TCDDCICONF!$A$15,\"DCI\",B4,\"Conformité\",$F$1),\"\"),\"\")","v":""},{"$f":"IFERROR(IF(GETPIVOTDATA(\"Nombre de Conformité2\",TCDDCICONF!$A$15,\"DCI\",B4,\"Conformité\",$G$1)<>0,GETPIVOTDATA(\"Nombre de Conformité2\",TCDDCICONF!$A$15,\"DCI\",B4,\"Conformité\",$G$1),\"\"),\"\")","v":""},{"$f":"IFERROR(IF(GETPIVOTDATA(\"Nombre de Conformité2\",TCDDCICONF!$A$15,\"DCI\",B4,\"Conformité\",$H$1)<>0,GETPIVOTDATA(\"Nombre de Conformité2\",TCDDCICONF!$A$15,\"DCI\",B4,\"Conformité\",$H$1),\"\"),\"\")","v":""},{"$f":"IFERROR(IF(GETPIVOTDATA(\"Nombre de Conformité2\",TCDDCICONF!$A$15,\"DCI\",B4,\"Conformité\",$I$1)<>0,GETPIVOTDATA(\"Nombre de Conformité2\",TCDDCICONF!$A$15,\"DCI\",B4,\"Conformité\",$I$1),\"\"),\"\")","v":""}]
[{"$f":"IFERROR(IF(INDEX(Référentiel_pour_Sphinx!$A$1:$F$235,MATCH(B5,Référentiel_pour_Sphinx!$A$1:$A$235,0),6)=0,\"\",INDEX(Référentiel_pour_Sphinx!$A$1:$F$235,MATCH(B5,Référentiel_pour_Sphinx!$A$1:$A$235,0),6)),\"\")","v":""},{"$f":"IF(TCDDCICONF!A21<>0,TCDDCICONF!A21,\"\")","v":""},{"$f":"IFERROR(GETPIVOTDATA(\"Conformité\",TCDDCICONF!$A$15,\"DCI\",B5),\"\")","v":""},{"$f":"IFERROR(IF(GETPIVOTDATA(\"Nombre de Conformité2\",TCDDCICONF!$A$15,\"DCI\",B5,\"Conformité\",$D$1)<>0,GETPIVOTDATA(\"Nombre de Conformité2\",TCDDCICONF!$A$15,\"DCI\",B5,\"Conformité\",$D$1),\"\"),\"\")","v":""},{"$f":"IFERROR(IF(GETPIVOTDATA(\"Nombre de Conformité2\",TCDDCICONF!$A$15,\"DCI\",B5,\"Conformité\",$E$1)<>0,GETPIVOTDATA(\"Nombre de Conformité2\",TCDDCICONF!$A$15,\"DCI\",B5,\"Conformité\",$E$1),\"\"),\"\")","v":""},{"$f":"IFERROR(IF(GETPIVOTDATA(\"Nombre de Conformité2\",TCDDCICONF!$A$15,\"DCI\",B5,\"Conformité\",$F$1)<>0,GETPIVOTDATA(\"Nombre de Conformité2\",TCDDCICONF!$A$15,\"DCI\",B5,\"Conformité\",$F$1),\"\"),\"\")","v":""},{"$f":"IFERROR(IF(GETPIVOTDATA(\"Nombre de Conformité2\",TCDDCICONF!$A$15,\"DCI\",B5,\"Conformité\",$G$1)<>0,GETPIVOTDATA(\"Nombre de Conformité2\",TCDDCICONF!$A$15,\"DCI\",B5,\"Conformité\",$G$1),\"\"),\"\")","v":""},{"$f":"IFERROR(IF(GETPIVOTDATA(\"Nombre de Conformité2\",TCDDCICONF!$A$15,\"DCI\",B5,\"Conformité\",$H$1)<>0,GETPIVOTDATA(\"Nombre de Conformité2\",TCDDCICONF!$A$15,\"DCI\",B5,\"Conformité\",$H$1),\"\"),\"\")","v":""},{"$f":"IFERROR(IF(GETPIVOTDATA(\"Nombre de Conformité2\",TCDDCICONF!$A$15,\"DCI\",B5,\"Conformité\",$I$1)<>0,GETPIVOTDATA(\"Nombre de Conformité2\",TCDDCICONF!$A$15,\"DCI\",B5,\"Conformité\",$I$1),\"\"),\"\")","v":""}]
[{"$f":"IFERROR(IF(INDEX(Référentiel_pour_Sphinx!$A$1:$F$235,MATCH(B6,Référentiel_pour_Sphinx!$A$1:$A$235,0),6)=0,\"\",INDEX(Référentiel_pour_Sphinx!$A$1:$F$235,MATCH(B6,Référentiel_pour_Sphinx!$A$1:$A$235,0),6)),\"\")","v":""},{"$f":"IF(TCDDCICONF!A22<>0,TCDDCICONF!A22,\"\")","v":""},{"$f":"IFERROR(GETPIVOTDATA(\"Conformité\",TCDDCICONF!$A$15,\"DCI\",B6),\"\")","v":""},{"$f":"IFERROR(IF(GETPIVOTDATA(\"Nombre de Conformité2\",TCDDCICONF!$A$15,\"DCI\",B6,\"Conformité\",$D$1)<>0,GETPIVOTDATA(\"Nombre de Conformité2\",TCDDCICONF!$A$15,\"DCI\",B6,\"Conformité\",$D$1),\"\"),\"\")","v":""},{"$f":"IFERROR(IF(GETPIVOTDATA(\"Nombre de Conformité2\",TCDDCICONF!$A$15,\"DCI\",B6,\"Conformité\",$E$1)<>0,GETPIVOTDATA(\"Nombre de Conformité2\",TCDDCICONF!$A$15,\"DCI\",B6,\"Conformité\",$E$1),\"\"),\"\")","v":""},{"$f":"IFERROR(IF(GETPIVOTDATA(\"Nombre de Conformité2\",TCDDCICONF!$A$15,\"DCI\",B6,\"Conformité\",$F$1)<>0,GETPIVOTDATA(\"Nombre de Conformité2\",TCDDCICONF!$A$15,\"DCI\",B6,\"Conformité\",$F$1),\"\"),\"\")","v":""},{"$f":"IFERROR(IF(GETPIVOTDATA(\"Nombre de Conformité2\",TCDDCICONF!$A$15,\"DCI\",B6,\"Conformité\",$G$1)<>0,GETPIVOTDATA(\"Nombre de Conformité2\",TCDDCICONF!$A$15,\"DCI\",B6,\"Conformité\",$G$1),\"\"),\"\")","v":""},{"$f":"IFERROR(IF(GETPIVOTDATA(\"Nombre de Conformité2\",TCDDCICONF!$A$15,\"DCI\",B6,\"Conformité\",$H$1)<>0,GETPIVOTDATA(\"Nombre de Conformité2\",TCDDCICONF!$A$15,\"DCI\",B6,\"Conformité\",$H$1),\"\"),\"\")","v":""},{"$f":"IFERROR(IF(GETPIVOTDATA(\"Nombre de Conformité2\",TCDDCICONF!$A$15,\"DCI\",B6,\"Conformité\",$I$1)<>0,GETPIVOTDATA(\"Nombre de Conformité2\",TCDDCICONF!$A$15,\"DCI\",B6,\"Conformité\",$I$1),\"\"),\"\")","v":""}]
[{"$f":"IFERROR(IF(INDEX(Référentiel_pour_Sphinx!$A$1:$F$235,MATCH(B7,Référentiel_pour_Sphinx!$A$1:$A$235,0),6)=0,\"\",INDEX(Référentiel_pour_Sphinx!$A$1:$F$235,MATCH(B7,Référentiel_pour_Sphinx!$A$1:$A$235,0),6)),\"\")","v":""},{"$f":"IF(TCDDCICONF!A23<>0,TCDDCICONF!A23,\"\")","v":""},{"$f":"IFERROR(GETPIVOTDATA(\"Conformité\",TCDDCICONF!$A$15,\"DCI\",B7),\"\")","v":""},{"$f":"IFERROR(IF(GETPIVOTDATA(\"Nombre de Conformité2\",TCDDCICONF!$A$15,\"DCI\",B7,\"Conformité\",$D$1)<>0,GETPIVOTDATA(\"Nombre de Conformité2\",TCDDCICONF!$A$15,\"DCI\",B7,\"Conformité\",$D$1),\"\"),\"\")","v":""},{"$f":"IFERROR(IF(GETPIVOTDATA(\"Nombre de Conformité2\",TCDDCICONF!$A$15,\"DCI\",B7,\"Conformité\",$E$1)<>0,GETPIVOTDATA(\"Nombre de Conformité2\",TCDDCICONF!$A$15,\"DCI\",B7,\"Conformité\",$E$1),\"\"),\"\")","v":""},{"$f":"IFERROR(IF(GETPIVOTDATA(\"Nombre de Conformité2\",TCDDCICONF!$A$15,\"DCI\",B7,\"Conformité\",$F$1)<>0,GETPIVOTDATA(\"Nombre de Conformité2\",TCDDCICONF!$A$15,\"DCI\",B7,\"Conformité\",$F$1),\"\"),\"\")","v":""},{"$f":"IFERROR(IF(GETPIVOTDATA(\"Nombre de Conformité2\",TCDDCICONF!$A$15,\"DCI\",B7,\"Conformité\",$G$1)<>0,GETPIVOTDATA(\"Nombre de Conformité2\",TCDDCICONF!$A$15,\"DCI\",B7,\"Conformité\",$G$1),\"\"),\"\")","v":""},{"$f":"IFERROR(IF(GETPIVOTDATA(\"Nombre de Conformité2\",TCDDCICONF!$A$15,\"DCI\",B7,\"Conformité\",$H$1)<>0,GETPIVOTDATA(\"Nombre de Conformité2\",TCDDCICONF!$A$15,\"DCI\",B7,\"Conformité\",$H$1),\"\"),\"\")","v":""},{"$f":"IFERROR(IF(GETPIVOTDATA(\"Nombre de Conformité2\",TCDDCICONF!$A$15,\"DCI\",B7,\"Conformité\",$I$1)<>0,GETPIVOTDATA(\"Nombre de Conformité2\",TCDDCICONF!$A$15,\"DCI\",B7,\"Conformité\",$I$1),\"\"),\"\")","v":""}]
[{"$f":"IFERROR(IF(INDEX(Référentiel_pour_Sphinx!$A$1:$F$235,MATCH(B8,Référentiel_pour_Sphinx!$A$1:$A$235,0),6)=0,\"\",INDEX(Référentiel_pour_Sphinx!$A$1:$F$235,MATCH(B8,Référentiel_pour_Sphinx!$A$1:$A$235,0),6)),\"\")","v":""},{"$f":"IF(TCDDCICONF!A24<>0,TCDDCICONF!A24,\"\")","v":""},{"$f":"IFERROR(GETPIVOTDATA(\"Conformité\",TCDDCICONF!$A$15,\"DCI\",B8),\"\")","v":""},{"$f":"IFERROR(IF(GETPIVOTDATA(\"Nombre de Conformité2\",TCDDCICONF!$A$15,\"DCI\",B8,\"Conformité\",$D$1)<>0,GETPIVOTDATA(\"Nombre de Conformité2\",TCDDCICONF!$A$15,\"DCI\",B8,\"Conformité\",$D$1),\"\"),\"\")","v":""},{"$f":"IFERROR(IF(GETPIVOTDATA(\"Nombre de Conformité2\",TCDDCICONF!$A$15,\"DCI\",B8,\"Conformité\",$E$1)<>0,GETPIVOTDATA(\"Nombre de Conformité2\",TCDDCICONF!$A$15,\"DCI\",B8,\"Conformité\",$E$1),\"\"),\"\")","v":""},{"$f":"IFERROR(IF(GETPIVOTDATA(\"Nombre de Conformité2\",TCDDCICONF!$A$15,\"DCI\",B8,\"Conformité\",$F$1)<>0,GETPIVOTDATA(\"Nombre de Conformité2\",TCDDCICONF!$A$15,\"DCI\",B8,\"Conformité\",$F$1),\"\"),\"\")","v":""},{"$f":"IFERROR(IF(GETPIVOTDATA(\"Nombre de Conformité2\",TCDDCICONF!$A$15,\"DCI\",B8,\"Conformité\",$G$1)<>0,GETPIVOTDATA(\"Nombre de Conformité2\",TCDDCICONF!$A$15,\"DCI\",B8,\"Conformité\",$G$1),\"\"),\"\")","v":""},{"$f":"IFERROR(IF(GETPIVOTDATA(\"Nombre de Conformité2\",TCDDCICONF!$A$15,\"DCI\",B8,\"Conformité\",$H$1)<>0,GETPIVOTDATA(\"Nombre de Conformité2\",TCDDCICONF!$A$15,\"DCI\",B8,\"Conformité\",$H$1),\"\"),\"\")","v":""},{"$f":"IFERROR(IF(GETPIVOTDATA(\"Nombre de Conformité2\",TCDDCICONF!$A$15,\"DCI\",B8,\"Conformité\",$I$1)<>0,GETPIVOTDATA(\"Nombre de Conformité2\",TCDDCICONF!$A$15,\"DCI\",B8,\"Conformité\",$I$1),\"\"),\"\")","v":""}]
[{"$f":"IFERROR(IF(INDEX(Référentiel_pour_Sphinx!$A$1:$F$235,MATCH(B9,Référentiel_pour_Sphinx!$A$1:$A$235,0),6)=0,\"\",INDEX(Référentiel_pour_Sphinx!$A$1:$F$235,MATCH(B9,Référentiel_pour_Sphinx!$A$1:$A$235,0),6)),\"\")","v":""},{"$f":"IF(TCDDCICONF!A25<>0,TCDDCICONF!A25,\"\")","v":""},{"$f":"IFERROR(GETPIVOTDATA(\"Conformité\",TCDDCICONF!$A$15,\"DCI\",B9),\"\")","v":""},{"$f":"IFERROR(IF(GETPIVOTDATA(\"Nombre de Conformité2\",TCDDCICONF!$A$15,\"DCI\",B9,\"Conformité\",$D$1)<>0,GETPIVOTDATA(\"Nombre de Conformité2\",TCDDCICONF!$A$15,\"DCI\",B9,\"Conformité\",$D$1),\"\"),\"\")","v":""},{"$f":"IFERROR(IF(GETPIVOTDATA(\"Nombre de Conformité2\",TCDDCICONF!$A$15,\"DCI\",B9,\"Conformité\",$E$1)<>0,GETPIVOTDATA(\"Nombre de Conformité2\",TCDDCICONF!$A$15,\"DCI\",B9,\"Conformité\",$E$1),\"\"),\"\")","v":""},{"$f":"IFERROR(IF(GETPIVOTDATA(\"Nombre de Conformité2\",TCDDCICONF!$A$15,\"DCI\",B9,\"Conformité\",$F$1)<>0,GETPIVOTDATA(\"Nombre de Conformité2\",TCDDCICONF!$A$15,\"DCI\",B9,\"Conformité\",$F$1),\"\"),\"\")","v":""},{"$f":"IFERROR(IF(GETPIVOTDATA(\"Nombre de Conformité2\",TCDDCICONF!$A$15,\"DCI\",B9,\"Conformité\",$G$1)<>0,GETPIVOTDATA(\"Nombre de Conformité2\",TCDDCICONF!$A$15,\"DCI\",B9,\"Conformité\",$G$1),\"\"),\"\")","v":""},{"$f":"IFERROR(IF(GETPIVOTDATA(\"Nombre de Conformité2\",TCDDCICONF!$A$15,\"DCI\",B9,\"Conformité\",$H$1)<>0,GETPIVOTDATA(\"Nombre de Conformité2\",TCDDCICONF!$A$15,\"DCI\",B9,\"Conformité\",$H$1),\"\"),\"\")","v":""},{"$f":"IFERROR(IF(GETPIVOTDATA(\"Nombre de Conformité2\",TCDDCICONF!$A$15,\"DCI\",B9,\"Conformité\",$I$1)<>0,GETPIVOTDATA(\"Nombre de Conformité2\",TCDDCICONF!$A$15,\"DCI\",B9,\"Conformité\",$I$1),\"\"),\"\")","v":""}]
[{"$f":"IFERROR(IF(INDEX(Référentiel_pour_Sphinx!$A$1:$F$235,MATCH(B10,Référentiel_pour_Sphinx!$A$1:$A$235,0),6)=0,\"\",INDEX(Référentiel_pour_Sphinx!$A$1:$F$235,MATCH(B10,Référentiel_pour_Sphinx!$A$1:$A$235,0),6)),\"\")","v":""},{"$f":"IF(TCDDCICONF!A26<>0,TCDDCICONF!A26,\"\")","v":""},{"$f":"IFERROR(GETPIVOTDATA(\"Conformité\",TCDDCICONF!$A$15,\"DCI\",B10),\"\")","v":""},{"$f":"IFERROR(IF(GETPIVOTDATA(\"Nombre de Conformité2\",TCDDCICONF!$A$15,\"DCI\",B10,\"Conformité\",$D$1)<>0,GETPIVOTDATA(\"Nombre de Conformité2\",TCDDCICONF!$A$15,\"DCI\",B10,\"Conformité\",$D$1),\"\"),\"\")","v":""},{"$f":"IFERROR(IF(GETPIVOTDATA(\"Nombre de Conformité2\",TCDDCICONF!$A$15,\"DCI\",B10,\"Conformité\",$E$1)<>0,GETPIVOTDATA(\"Nombre de Conformité2\",TCDDCICONF!$A$15,\"DCI\",B10,\"Conformité\",$E$1),\"\"),\"\")","v":""},{"$f":"IFERROR(IF(GETPIVOTDATA(\"Nombre de Conformité2\",TCDDCICONF!$A$15,\"DCI\",B10,\"Conformité\",$F$1)<>0,GETPIVOTDATA(\"Nombre de Conformité2\",TCDDCICONF!$A$15,\"DCI\",B10,\"Conformité\",$F$1),\"\"),\"\")","v":""},{"$f":"IFERROR(IF(GETPIVOTDATA(\"Nombre de Conformité2\",TCDDCICONF!$A$15,\"DCI\",B10,\"Conformité\",$G$1)<>0,GETPIVOTDATA(\"Nombre de Conformité2\",TCDDCICONF!$A$15,\"DCI\",B10,\"Conformité\",$G$1),\"\"),\"\")","v":""},{"$f":"IFERROR(IF(GETPIVOTDATA(\"Nombre de Conformité2\",TCDDCICONF!$A$15,\"DCI\",B10,\"Conformité\",$H$1)<>0,GETPIVOTDATA(\"Nombre de Conformité2\",TCDDCICONF!$A$15,\"DCI\",B10,\"Conformité\",$H$1),\"\"),\"\")","v":""},{"$f":"IFERROR(IF(GETPIVOTDATA(\"Nombre de Conformité2\",TCDDCICONF!$A$15,\"DCI\",B10,\"Conformité\",$I$1)<>0,GETPIVOTDATA(\"Nombre de Conformité2\",TCDDCICONF!$A$15,\"DCI\",B10,\"Conformité\",$I$1),\"\"),\"\")","v":""}]
[{"$f":"IFERROR(IF(INDEX(Référentiel_pour_Sphinx!$A$1:$F$235,MATCH(B11,Référentiel_pour_Sphinx!$A$1:$A$235,0),6)=0,\"\",INDEX(Référentiel_pour_Sphinx!$A$1:$F$235,MATCH(B11,Référentiel_pour_Sphinx!$A$1:$A$235,0),6)),\"\")","v":""},{"$f":"IF(TCDDCICONF!A27<>0,TCDDCICONF!A27,\"\")","v":""},{"$f":"IFERROR(GETPIVOTDATA(\"Conformité\",TCDDCICONF!$A$15,\"DCI\",B11),\"\")","v":""},{"$f":"IFERROR(IF(GETPIVOTDATA(\"Nombre de Conformité2\",TCDDCICONF!$A$15,\"DCI\",B11,\"Conformité\",$D$1)<>0,GETPIVOTDATA(\"Nombre de Conformité2\",TCDDCICONF!$A$15,\"DCI\",B11,\"Conformité\",$D$1),\"\"),\"\")","v":""},{"$f":"IFERROR(IF(GETPIVOTDATA(\"Nombre de Conformité2\",TCDDCICONF!$A$15,\"DCI\",B11,\"Conformité\",$E$1)<>0,GETPIVOTDATA(\"Nombre de Conformité2\",TCDDCICONF!$A$15,\"DCI\",B11,\"Conformité\",$E$1),\"\"),\"\")","v":""},{"$f":"IFERROR(IF(GETPIVOTDATA(\"Nombre de Conformité2\",TCDDCICONF!$A$15,\"DCI\",B11,\"Conformité\",$F$1)<>0,GETPIVOTDATA(\"Nombre de Conformité2\",TCDDCICONF!$A$15,\"DCI\",B11,\"Conformité\",$F$1),\"\"),\"\")","v":""},{"$f":"IFERROR(IF(GETPIVOTDATA(\"Nombre de Conformité2\",TCDDCICONF!$A$15,\"DCI\",B11,\"Conformité\",$G$1)<>0,GETPIVOTDATA(\"Nombre de Conformité2\",TCDDCICONF!$A$15,\"DCI\",B11,\"Conformité\",$G$1),\"\"),\"\")","v":""},{"$f":"IFERROR(IF(GETPIVOTDATA(\"Nombre de Conformité2\",TCDDCICONF!$A$15,\"DCI\",B11,\"Conformité\",$H$1)<>0,GETPIVOTDATA(\"Nombre de Conformité2\",TCDDCICONF!$A$15,\"DCI\",B11,\"Conformité\",$H$1),\"\"),\"\")","v":""},{"$f":"IFERROR(IF(GETPIVOTDATA(\"Nombre de Conformité2\",TCDDCICONF!$A$15,\"DCI\",B11,\"Conformité\",$I$1)<>0,GETPIVOTDATA(\"Nombre de Conformité2\",TCDDCICONF!$A$15,\"DCI\",B11,\"Conformité\",$I$1),\"\"),\"\")","v":""}]
[{"$f":"IFERROR(IF(INDEX(Référentiel_pour_Sphinx!$A$1:$F$110,MATCH(B12,Référentiel_pour_Sphinx!$A$1:$A$110,0),4)=0,\"\",INDEX(Référentiel_pour_Sphinx!$A$1:$F$110,MATCH(B12,Référentiel_pour_Sphinx!$A$1:$A$110,0),4)),\"\")","v":""},{"$f":"IF(TCDDCICONF!A28<>0,TCDDCICONF!A28,\"\")","v":""},{"$f":"IFERROR(GETPIVOTDATA(\"Conformité\",TCDDCICONF!$A$15,\"DCI\",B12),\"\")","v":""},{"$f":"IFERROR(IF(GETPIVOTDATA(\"Nombre de Conformité2\",TCDDCICONF!$A$15,\"DCI\",B12,\"Conformité\",$D$1)<>0,GETPIVOTDATA(\"Nombre de Conformité2\",TCDDCICONF!$A$15,\"DCI\",B12,\"Conformité\",$D$1),\"\"),\"\")","v":""},{"$f":"IFERROR(IF(GETPIVOTDATA(\"Nombre de Conformité2\",TCDDCICONF!$A$15,\"DCI\",B12,\"Conformité\",$E$1)<>0,GETPIVOTDATA(\"Nombre de Conformité2\",TCDDCICONF!$A$15,\"DCI\",B12,\"Conformité\",$E$1),\"\"),\"\")","v":""},{"$f":"IFERROR(IF(GETPIVOTDATA(\"Nombre de Conformité2\",TCDDCICONF!$A$15,\"DCI\",B12,\"Conformité\",$F$1)<>0,GETPIVOTDATA(\"Nombre de Conformité2\",TCDDCICONF!$A$15,\"DCI\",B12,\"Conformité\",$F$1),\"\"),\"\")","v":""},{"$f":"IFERROR(IF(GETPIVOTDATA(\"Nombre de Conformité2\",TCDDCICONF!$A$15,\"DCI\",B12,\"Conformité\",$G$1)<>0,GETPIVOTDATA(\"Nombre de Conformité2\",TCDDCICONF!$A$15,\"DCI\",B12,\"Conformité\",$G$1),\"\"),\"\")","v":""},{"$f":"IFERROR(IF(GETPIVOTDATA(\"Nombre de Conformité2\",TCDDCICONF!$A$15,\"DCI\",B12,\"Conformité\",$H$1)<>0,GETPIVOTDATA(\"Nombre de Conformité2\",TCDDCICONF!$A$15,\"DCI\",B12,\"Conformité\",$H$1),\"\"),\"\")","v":""},{"$f":"IFERROR(IF(GETPIVOTDATA(\"Nombre de Conformité2\",TCDDCICONF!$A$15,\"DCI\",B12,\"Conformité\",$I$1)<>0,GETPIVOTDATA(\"Nombre de Conformité2\",TCDDCICONF!$A$15,\"DCI\",B12,\"Conformité\",$I$1),\"\"),\"\")","v":""}]
[{"$f":"IFERROR(IF(INDEX(Référentiel_pour_Sphinx!$A$1:$F$110,MATCH(B13,Référentiel_pour_Sphinx!$A$1:$A$110,0),4)=0,\"\",INDEX(Référentiel_pour_Sphinx!$A$1:$F$110,MATCH(B13,Référentiel_pour_Sphinx!$A$1:$A$110,0),4)),\"\")","v":""},{"$f":"IF(TCDDCICONF!A29<>0,TCDDCICONF!A29,\"\")","v":""},{"$f":"IFERROR(GETPIVOTDATA(\"Conformité\",TCDDCICONF!$A$15,\"DCI\",B13),\"\")","v":""},{"$f":"IFERROR(IF(GETPIVOTDATA(\"Nombre de Conformité2\",TCDDCICONF!$A$15,\"DCI\",B13,\"Conformité\",$D$1)<>0,GETPIVOTDATA(\"Nombre de Conformité2\",TCDDCICONF!$A$15,\"DCI\",B13,\"Conformité\",$D$1),\"\"),\"\")","v":""},{"$f":"IFERROR(IF(GETPIVOTDATA(\"Nombre de Conformité2\",TCDDCICONF!$A$15,\"DCI\",B13,\"Conformité\",$E$1)<>0,GETPIVOTDATA(\"Nombre de Conformité2\",TCDDCICONF!$A$15,\"DCI\",B13,\"Conformité\",$E$1),\"\"),\"\")","v":""},{"$f":"IFERROR(IF(GETPIVOTDATA(\"Nombre de Conformité2\",TCDDCICONF!$A$15,\"DCI\",B13,\"Conformité\",$F$1)<>0,GETPIVOTDATA(\"Nombre de Conformité2\",TCDDCICONF!$A$15,\"DCI\",B13,\"Conformité\",$F$1),\"\"),\"\")","v":""},{"$f":"IFERROR(IF(GETPIVOTDATA(\"Nombre de Conformité2\",TCDDCICONF!$A$15,\"DCI\",B13,\"Conformité\",$G$1)<>0,GETPIVOTDATA(\"Nombre de Conformité2\",TCDDCICONF!$A$15,\"DCI\",B13,\"Conformité\",$G$1),\"\"),\"\")","v":""},{"$f":"IFERROR(IF(GETPIVOTDATA(\"Nombre de Conformité2\",TCDDCICONF!$A$15,\"DCI\",B13,\"Conformité\",$H$1)<>0,GETPIVOTDATA(\"Nombre de Conformité2\",TCDDCICONF!$A$15,\"DCI\",B13,\"Conformité\",$H$1),\"\"),\"\")","v":""},{"$f":"IFERROR(IF(GETPIVOTDATA(\"Nombre de Conformité2\",TCDDCICONF!$A$15,\"DCI\",B13,\"Conformité\",$I$1)<>0,GETPIVOTDATA(\"Nombre de Conformité2\",TCDDCICONF!$A$15,\"DCI\",B13,\"Conformité\",$I$1),\"\"),\"\")","v":""}]
[{"$f":"IFERROR(IF(INDEX(Référentiel_pour_Sphinx!$A$1:$F$110,MATCH(B14,Référentiel_pour_Sphinx!$A$1:$A$110,0),4)=0,\"\",INDEX(Référentiel_pour_Sphinx!$A$1:$F$110,MATCH(B14,Référentiel_pour_Sphinx!$A$1:$A$110,0),4)),\"\")","v":""},{"$f":"IF(TCDDCICONF!A30<>0,TCDDCICONF!A30,\"\")","v":""},{"$f":"IFERROR(GETPIVOTDATA(\"Conformité\",TCDDCICONF!$A$15,\"DCI\",B14),\"\")","v":""},{"$f":"IFERROR(IF(GETPIVOTDATA(\"Nombre de Conformité2\",TCDDCICONF!$A$15,\"DCI\",B14,\"Conformité\",$D$1)<>0,GETPIVOTDATA(\"Nombre de Conformité2\",TCDDCICONF!$A$15,\"DCI\",B14,\"Conformité\",$D$1),\"\"),\"\")","v":""},{"$f":"IFERROR(IF(GETPIVOTDATA(\"Nombre de Conformité2\",TCDDCICONF!$A$15,\"DCI\",B14,\"Conformité\",$E$1)<>0,GETPIVOTDATA(\"Nombre de Conformité2\",TCDDCICONF!$A$15,\"DCI\",B14,\"Conformité\",$E$1),\"\"),\"\")","v":""},{"$f":"IFERROR(IF(GETPIVOTDATA(\"Nombre de Conformité2\",TCDDCICONF!$A$15,\"DCI\",B14,\"Conformité\",$F$1)<>0,GETPIVOTDATA(\"Nombre de Conformité2\",TCDDCICONF!$A$15,\"DCI\",B14,\"Conformité\",$F$1),\"\"),\"\")","v":""},{"$f":"IFERROR(IF(GETPIVOTDATA(\"Nombre de Conformité2\",TCDDCICONF!$A$15,\"DCI\",B14,\"Conformité\",$G$1)<>0,GETPIVOTDATA(\"Nombre de Conformité2\",TCDDCICONF!$A$15,\"DCI\",B14,\"Conformité\",$G$1),\"\"),\"\")","v":""},{"$f":"IFERROR(IF(GETPIVOTDATA(\"Nombre de Conformité2\",TCDDCICONF!$A$15,\"DCI\",B14,\"Conformité\",$H$1)<>0,GETPIVOTDATA(\"Nombre de Conformité2\",TCDDCICONF!$A$15,\"DCI\",B14,\"Conformité\",$H$1),\"\"),\"\")","v":""},{"$f":"IFERROR(IF(GETPIVOTDATA(\"Nombre de Conformité2\",TCDDCICONF!$A$15,\"DCI\",B14,\"Conformité\",$I$1)<>0,GETPIVOTDATA(\"Nombre de Conformité2\",TCDDCICONF!$A$15,\"DCI\",B14,\"Conformité\",$I$1),\"\"),\"\")","v":""}]
[{"$f":"IFERROR(IF(INDEX(Référentiel_pour_Sphinx!$A$1:$F$110,MATCH(B15,Référentiel_pour_Sphinx!$A$1:$A$110,0),4)=0,\"\",INDEX(Référentiel_pour_Sphinx!$A$1:$F$110,MATCH(B15,Référentiel_pour_Sphinx!$A$1:$A$110,0),4)),\"\")","v":""},{"$f":"IF(TCDDCICONF!A31<>0,TCDDCICONF!A31,\"\")","v":""},{"$f":"IFERROR(GETPIVOTDATA(\"Conformité\",TCDDCICONF!$A$15,\"DCI\",B15),\"\")","v":""},{"$f":"IFERROR(IF(GETPIVOTDATA(\"Nombre de Conformité2\",TCDDCICONF!$A$15,\"DCI\",B15,\"Conformité\",$D$1)<>0,GETPIVOTDATA(\"Nombre de Conformité2\",TCDDCICONF!$A$15,\"DCI\",B15,\"Conformité\",$D$1),\"\"),\"\")","v":""},{"$f":"IFERROR(IF(GETPIVOTDATA(\"Nombre de Conformité2\",TCDDCICONF!$A$15,\"DCI\",B15,\"Conformité\",$E$1)<>0,GETPIVOTDATA(\"Nombre de Conformité2\",TCDDCICONF!$A$15,\"DCI\",B15,\"Conformité\",$E$1),\"\"),\"\")","v":""},{"$f":"IFERROR(IF(GETPIVOTDATA(\"Nombre de Conformité2\",TCDDCICONF!$A$15,\"DCI\",B15,\"Conformité\",$F$1)<>0,GETPIVOTDATA(\"Nombre de Conformité2\",TCDDCICONF!$A$15,\"DCI\",B15,\"Conformité\",$F$1),\"\"),\"\")","v":""},{"$f":"IFERROR(IF(GETPIVOTDATA(\"Nombre de Conformité2\",TCDDCICONF!$A$15,\"DCI\",B15,\"Conformité\",$G$1)<>0,GETPIVOTDATA(\"Nombre de Conformité2\",TCDDCICONF!$A$15,\"DCI\",B15,\"Conformité\",$G$1),\"\"),\"\")","v":""},{"$f":"IFERROR(IF(GETPIVOTDATA(\"Nombre de Conformité2\",TCDDCICONF!$A$15,\"DCI\",B15,\"Conformité\",$H$1)<>0,GETPIVOTDATA(\"Nombre de Conformité2\",TCDDCICONF!$A$15,\"DCI\",B15,\"Conformité\",$H$1),\"\"),\"\")","v":""},{"$f":"IFERROR(IF(GETPIVOTDATA(\"Nombre de Conformité2\",TCDDCICONF!$A$15,\"DCI\",B15,\"Conformité\",$I$1)<>0,GETPIVOTDATA(\"Nombre de Conformité2\",TCDDCICONF!$A$15,\"DCI\",B15,\"Conformité\",$I$1),\"\"),\"\")","v":""}]
[{"$f":"IFERROR(IF(INDEX(Référentiel_pour_Sphinx!$A$1:$F$110,MATCH(B16,Référentiel_pour_Sphinx!$A$1:$A$110,0),4)=0,\"\",INDEX(Référentiel_pour_Sphinx!$A$1:$F$110,MATCH(B16,Référentiel_pour_Sphinx!$A$1:$A$110,0),4)),\"\")","v":""},{"$f":"IF(TCDDCICONF!A32<>0,TCDDCICONF!A32,\"\")","v":""},{"$f":"IFERROR(GETPIVOTDATA(\"Conformité\",TCDDCICONF!$A$15,\"DCI\",B16),\"\")","v":""},{"$f":"IFERROR(IF(GETPIVOTDATA(\"Nombre de Conformité2\",TCDDCICONF!$A$15,\"DCI\",B16,\"Conformité\",$D$1)<>0,GETPIVOTDATA(\"Nombre de Conformité2\",TCDDCICONF!$A$15,\"DCI\",B16,\"Conformité\",$D$1),\"\"),\"\")","v":""},{"$f":"IFERROR(IF(GETPIVOTDATA(\"Nombre de Conformité2\",TCDDCICONF!$A$15,\"DCI\",B16,\"Conformité\",$E$1)<>0,GETPIVOTDATA(\"Nombre de Conformité2\",TCDDCICONF!$A$15,\"DCI\",B16,\"Conformité\",$E$1),\"\"),\"\")","v":""},{"$f":"IFERROR(IF(GETPIVOTDATA(\"Nombre de Conformité2\",TCDDCICONF!$A$15,\"DCI\",B16,\"Conformité\",$F$1)<>0,GETPIVOTDATA(\"Nombre de Conformité2\",TCDDCICONF!$A$15,\"DCI\",B16,\"Conformité\",$F$1),\"\"),\"\")","v":""},{"$f":"IFERROR(IF(GETPIVOTDATA(\"Nombre de Conformité2\",TCDDCICONF!$A$15,\"DCI\",B16,\"Conformité\",$G$1)<>0,GETPIVOTDATA(\"Nombre de Conformité2\",TCDDCICONF!$A$15,\"DCI\",B16,\"Conformité\",$G$1),\"\"),\"\")","v":""},{"$f":"IFERROR(IF(GETPIVOTDATA(\"Nombre de Conformité2\",TCDDCICONF!$A$15,\"DCI\",B16,\"Conformité\",$H$1)<>0,GETPIVOTDATA(\"Nombre de Conformité2\",TCDDCICONF!$A$15,\"DCI\",B16,\"Conformité\",$H$1),\"\"),\"\")","v":""},{"$f":"IFERROR(IF(GETPIVOTDATA(\"Nombre de Conformité2\",TCDDCICONF!$A$15,\"DCI\",B16,\"Conformité\",$I$1)<>0,GETPIVOTDATA(\"Nombre de Conformité2\",TCDDCICONF!$A$15,\"DCI\",B16,\"Conformité\",$I$1),\"\"),\"\")","v":""}]
[{"$f":"IFERROR(IF(INDEX(Référentiel_pour_Sphinx!$A$1:$F$110,MATCH(B17,Référentiel_pour_Sphinx!$A$1:$A$110,0),4)=0,\"\",INDEX(Référentiel_pour_Sphinx!$A$1:$F$110,MATCH(B17,Référentiel_pour_Sphinx!$A$1:$A$110,0),4)),\"\")","v":""},{"$f":"IF(TCDDCICONF!A33<>0,TCDDCICONF!A33,\"\")","v":""},{"$f":"IFERROR(GETPIVOTDATA(\"Conformité\",TCDDCICONF!$A$15,\"DCI\",B17),\"\")","v":""},{"$f":"IFERROR(IF(GETPIVOTDATA(\"Nombre de Conformité2\",TCDDCICONF!$A$15,\"DCI\",B17,\"Conformité\",$D$1)<>0,GETPIVOTDATA(\"Nombre de Conformité2\",TCDDCICONF!$A$15,\"DCI\",B17,\"Conformité\",$D$1),\"\"),\"\")","v":""},{"$f":"IFERROR(IF(GETPIVOTDATA(\"Nombre de Conformité2\",TCDDCICONF!$A$15,\"DCI\",B17,\"Conformité\",$E$1)<>0,GETPIVOTDATA(\"Nombre de Conformité2\",TCDDCICONF!$A$15,\"DCI\",B17,\"Conformité\",$E$1),\"\"),\"\")","v":""},{"$f":"IFERROR(IF(GETPIVOTDATA(\"Nombre de Conformité2\",TCDDCICONF!$A$15,\"DCI\",B17,\"Conformité\",$F$1)<>0,GETPIVOTDATA(\"Nombre de Conformité2\",TCDDCICONF!$A$15,\"DCI\",B17,\"Conformité\",$F$1),\"\"),\"\")","v":""},{"$f":"IFERROR(IF(GETPIVOTDATA(\"Nombre de Conformité2\",TCDDCICONF!$A$15,\"DCI\",B17,\"Conformité\",$G$1)<>0,GETPIVOTDATA(\"Nombre de Conformité2\",TCDDCICONF!$A$15,\"DCI\",B17,\"Conformité\",$G$1),\"\"),\"\")","v":""},{"$f":"IFERROR(IF(GETPIVOTDATA(\"Nombre de Conformité2\",TCDDCICONF!$A$15,\"DCI\",B17,\"Conformité\",$H$1)<>0,GETPIVOTDATA(\"Nombre de Conformité2\",TCDDCICONF!$A$15,\"DCI\",B17,\"Conformité\",$H$1),\"\"),\"\")","v":""},{"$f":"IFERROR(IF(GETPIVOTDATA(\"Nombre de Conformité2\",TCDDCICONF!$A$15,\"DCI\",B17,\"Conformité\",$I$1)<>0,GETPIVOTDATA(\"Nombre de Conformité2\",TCDDCICONF!$A$15,\"DCI\",B17,\"Conformité\",$I$1),\"\"),\"\")","v":""}]
[{"$f":"IFERROR(IF(INDEX(Référentiel_pour_Sphinx!$A$1:$F$110,MATCH(B18,Référentiel_pour_Sphinx!$A$1:$A$110,0),4)=0,\"\",INDEX(Référentiel_pour_Sphinx!$A$1:$F$110,MATCH(B18,Référentiel_pour_Sphinx!$A$1:$A$110,0),4)),\"\")","v":""},{"$f":"IF(TCDDCICONF!A34<>0,TCDDCICONF!A34,\"\")","v":""},{"$f":"IFERROR(GETPIVOTDATA(\"Conformité\",TCDDCICONF!$A$15,\"DCI\",B18),\"\")","v":""},{"$f":"IFERROR(IF(GETPIVOTDATA(\"Nombre de Conformité2\",TCDDCICONF!$A$15,\"DCI\",B18,\"Conformité\",$D$1)<>0,GETPIVOTDATA(\"Nombre de Conformité2\",TCDDCICONF!$A$15,\"DCI\",B18,\"Conformité\",$D$1),\"\"),\"\")","v":""},{"$f":"IFERROR(IF(GETPIVOTDATA(\"Nombre de Conformité2\",TCDDCICONF!$A$15,\"DCI\",B18,\"Conformité\",$E$1)<>0,GETPIVOTDATA(\"Nombre de Conformité2\",TCDDCICONF!$A$15,\"DCI\",B18,\"Conformité\",$E$1),\"\"),\"\")","v":""},{"$f":"IFERROR(IF(GETPIVOTDATA(\"Nombre de Conformité2\",TCDDCICONF!$A$15,\"DCI\",B18,\"Conformité\",$F$1)<>0,GETPIVOTDATA(\"Nombre de Conformité2\",TCDDCICONF!$A$15,\"DCI\",B18,\"Conformité\",$F$1),\"\"),\"\")","v":""},{"$f":"IFERROR(IF(GETPIVOTDATA(\"Nombre de Conformité2\",TCDDCICONF!$A$15,\"DCI\",B18,\"Conformité\",$G$1)<>0,GETPIVOTDATA(\"Nombre de Conformité2\",TCDDCICONF!$A$15,\"DCI\",B18,\"Conformité\",$G$1),\"\"),\"\")","v":""},{"$f":"IFERROR(IF(GETPIVOTDATA(\"Nombre de Conformité2\",TCDDCICONF!$A$15,\"DCI\",B18,\"Conformité\",$H$1)<>0,GETPIVOTDATA(\"Nombre de Conformité2\",TCDDCICONF!$A$15,\"DCI\",B18,\"Conformité\",$H$1),\"\"),\"\")","v":""},{"$f":"IFERROR(IF(GETPIVOTDATA(\"Nombre de Conformité2\",TCDDCICONF!$A$15,\"DCI\",B18,\"Conformité\",$I$1)<>0,GETPIVOTDATA(\"Nombre de Conformité2\",TCDDCICONF!$A$15,\"DCI\",B18,\"Conformité\",$I$1),\"\"),\"\")","v":""}]
[{"$f":"IFERROR(IF(INDEX(Référentiel_pour_Sphinx!$A$1:$F$110,MATCH(B19,Référentiel_pour_Sphinx!$A$1:$A$110,0),4)=0,\"\",INDEX(Référentiel_pour_Sphinx!$A$1:$F$110,MATCH(B19,Référentiel_pour_Sphinx!$A$1:$A$110,0),4)),\"\")","v":""},{"$f":"IF(TCDDCICONF!A35<>0,TCDDCICONF!A35,\"\")","v":""},{"$f":"IFERROR(GETPIVOTDATA(\"Conformité\",TCDDCICONF!$A$15,\"DCI\",B19),\"\")","v":""},{"$f":"IFERROR(IF(GETPIVOTDATA(\"Nombre de Conformité2\",TCDDCICONF!$A$15,\"DCI\",B19,\"Conformité\",$D$1)<>0,GETPIVOTDATA(\"Nombre de Conformité2\",TCDDCICONF!$A$15,\"DCI\",B19,\"Conformité\",$D$1),\"\"),\"\")","v":""},{"$f":"IFERROR(IF(GETPIVOTDATA(\"Nombre de Conformité2\",TCDDCICONF!$A$15,\"DCI\",B19,\"Conformité\",$E$1)<>0,GETPIVOTDATA(\"Nombre de Conformité2\",TCDDCICONF!$A$15,\"DCI\",B19,\"Conformité\",$E$1),\"\"),\"\")","v":""},{"$f":"IFERROR(IF(GETPIVOTDATA(\"Nombre de Conformité2\",TCDDCICONF!$A$15,\"DCI\",B19,\"Conformité\",$F$1)<>0,GETPIVOTDATA(\"Nombre de Conformité2\",TCDDCICONF!$A$15,\"DCI\",B19,\"Conformité\",$F$1),\"\"),\"\")","v":""},{"$f":"IFERROR(IF(GETPIVOTDATA(\"Nombre de Conformité2\",TCDDCICONF!$A$15,\"DCI\",B19,\"Conformité\",$G$1)<>0,GETPIVOTDATA(\"Nombre de Conformité2\",TCDDCICONF!$A$15,\"DCI\",B19,\"Conformité\",$G$1),\"\"),\"\")","v":""},{"$f":"IFERROR(IF(GETPIVOTDATA(\"Nombre de Conformité2\",TCDDCICONF!$A$15,\"DCI\",B19,\"Conformité\",$H$1)<>0,GETPIVOTDATA(\"Nombre de Conformité2\",TCDDCICONF!$A$15,\"DCI\",B19,\"Conformité\",$H$1),\"\"),\"\")","v":""},{"$f":"IFERROR(IF(GETPIVOTDATA(\"Nombre de Conformité2\",TCDDCICONF!$A$15,\"DCI\",B19,\"Conformité\",$I$1)<>0,GETPIVOTDATA(\"Nombre de Conformité2\",TCDDCICONF!$A$15,\"DCI\",B19,\"Conformité\",$I$1),\"\"),\"\")","v":""}]
[{"$f":"IFERROR(IF(INDEX(Référentiel_pour_Sphinx!$A$1:$F$110,MATCH(B20,Référentiel_pour_Sphinx!$A$1:$A$110,0),4)=0,\"\",INDEX(Référentiel_pour_Sphinx!$A$1:$F$110,MATCH(B20,Référentiel_pour_Sphinx!$A$1:$A$110,0),4)),\"\")","v":""},{"$f":"IF(TCDDCICONF!A36<>0,TCDDCICONF!A36,\"\")","v":""},{"$f":"IFERROR(GETPIVOTDATA(\"Conformité\",TCDDCICONF!$A$15,\"DCI\",B20),\"\")","v":""},{"$f":"IFERROR(IF(GETPIVOTDATA(\"Nombre de Conformité2\",TCDDCICONF!$A$15,\"DCI\",B20,\"Conformité\",$D$1)<>0,GETPIVOTDATA(\"Nombre de Conformité2\",TCDDCICONF!$A$15,\"DCI\",B20,\"Conformité\",$D$1),\"\"),\"\")","v":""},{"$f":"IFERROR(IF(GETPIVOTDATA(\"Nombre de Conformité2\",TCDDCICONF!$A$15,\"DCI\",B20,\"Conformité\",$E$1)<>0,GETPIVOTDATA(\"Nombre de Conformité2\",TCDDCICONF!$A$15,\"DCI\",B20,\"Conformité\",$E$1),\"\"),\"\")","v":""},{"$f":"IFERROR(IF(GETPIVOTDATA(\"Nombre de Conformité2\",TCDDCICONF!$A$15,\"DCI\",B20,\"Conformité\",$F$1)<>0,GETPIVOTDATA(\"Nombre de Conformité2\",TCDDCICONF!$A$15,\"DCI\",B20,\"Conformité\",$F$1),\"\"),\"\")","v":""},{"$f":"IFERROR(IF(GETPIVOTDATA(\"Nombre de Conformité2\",TCDDCICONF!$A$15,\"DCI\",B20,\"Conformité\",$G$1)<>0,GETPIVOTDATA(\"Nombre de Conformité2\",TCDDCICONF!$A$15,\"DCI\",B20,\"Conformité\",$G$1),\"\"),\"\")","v":""},{"$f":"IFERROR(IF(GETPIVOTDATA(\"Nombre de Conformité2\",TCDDCICONF!$A$15,\"DCI\",B20,\"Conformité\",$H$1)<>0,GETPIVOTDATA(\"Nombre de Conformité2\",TCDDCICONF!$A$15,\"DCI\",B20,\"Conformité\",$H$1),\"\"),\"\")","v":""},{"$f":"IFERROR(IF(GETPIVOTDATA(\"Nombre de Conformité2\",TCDDCICONF!$A$15,\"DCI\",B20,\"Conformité\",$I$1)<>0,GETPIVOTDATA(\"Nombre de Conformité2\",TCDDCICONF!$A$15,\"DCI\",B20,\"Conformité\",$I$1),\"\"),\"\")","v":""}]
[{"$f":"IFERROR(IF(INDEX(Référentiel_pour_Sphinx!$A$1:$F$110,MATCH(B21,Référentiel_pour_Sphinx!$A$1:$A$110,0),4)=0,\"\",INDEX(Référentiel_pour_Sphinx!$A$1:$F$110,MATCH(B21,Référentiel_pour_Sphinx!$A$1:$A$110,0),4)),\"\")","v":""},{"$f":"IF(TCDDCICONF!A37<>0,TCDDCICONF!A37,\"\")","v":""},{"$f":"IFERROR(GETPIVOTDATA(\"Conformité\",TCDDCICONF!$A$15,\"DCI\",B21),\"\")","v":""},{"$f":"IFERROR(IF(GETPIVOTDATA(\"Nombre de Conformité2\",TCDDCICONF!$A$15,\"DCI\",B21,\"Conformité\",$D$1)<>0,GETPIVOTDATA(\"Nombre de Conformité2\",TCDDCICONF!$A$15,\"DCI\",B21,\"Conformité\",$D$1),\"\"),\"\")","v":""},{"$f":"IFERROR(IF(GETPIVOTDATA(\"Nombre de Conformité2\",TCDDCICONF!$A$15,\"DCI\",B21,\"Conformité\",$E$1)<>0,GETPIVOTDATA(\"Nombre de Conformité2\",TCDDCICONF!$A$15,\"DCI\",B21,\"Conformité\",$E$1),\"\"),\"\")","v":""},{"$f":"IFERROR(IF(GETPIVOTDATA(\"Nombre de Conformité2\",TCDDCICONF!$A$15,\"DCI\",B21,\"Conformité\",$F$1)<>0,GETPIVOTDATA(\"Nombre de Conformité2\",TCDDCICONF!$A$15,\"DCI\",B21,\"Conformité\",$F$1),\"\"),\"\")","v":""},{"$f":"IFERROR(IF(GETPIVOTDATA(\"Nombre de Conformité2\",TCDDCICONF!$A$15,\"DCI\",B21,\"Conformité\",$G$1)<>0,GETPIVOTDATA(\"Nombre de Conformité2\",TCDDCICONF!$A$15,\"DCI\",B21,\"Conformité\",$G$1),\"\"),\"\")","v":""},{"$f":"IFERROR(IF(GETPIVOTDATA(\"Nombre de Conformité2\",TCDDCICONF!$A$15,\"DCI\",B21,\"Conformité\",$H$1)<>0,GETPIVOTDATA(\"Nombre de Conformité2\",TCDDCICONF!$A$15,\"DCI\",B21,\"Conformité\",$H$1),\"\"),\"\")","v":""},{"$f":"IFERROR(IF(GETPIVOTDATA(\"Nombre de Conformité2\",TCDDCICONF!$A$15,\"DCI\",B21,\"Conformité\",$I$1)<>0,GETPIVOTDATA(\"Nombre de Conformité2\",TCDDCICONF!$A$15,\"DCI\",B21,\"Conformité\",$I$1),\"\"),\"\")","v":""}]
[{"$f":"IFERROR(IF(INDEX(Référentiel_pour_Sphinx!$A$1:$F$110,MATCH(B22,Référentiel_pour_Sphinx!$A$1:$A$110,0),4)=0,\"\",INDEX(Référentiel_pour_Sphinx!$A$1:$F$110,MATCH(B22,Référentiel_pour_Sphinx!$A$1:$A$110,0),4)),\"\")","v":""},{"$f":"IF(TCDDCICONF!A38<>0,TCDDCICONF!A38,\"\")","v":""},{"$f":"IFERROR(GETPIVOTDATA(\"Conformité\",TCDDCICONF!$A$15,\"DCI\",B22),\"\")","v":""},{"$f":"IFERROR(IF(GETPIVOTDATA(\"Nombre de Conformité2\",TCDDCICONF!$A$15,\"DCI\",B22,\"Conformité\",$D$1)<>0,GETPIVOTDATA(\"Nombre de Conformité2\",TCDDCICONF!$A$15,\"DCI\",B22,\"Conformité\",$D$1),\"\"),\"\")","v":""},{"$f":"IFERROR(IF(GETPIVOTDATA(\"Nombre de Conformité2\",TCDDCICONF!$A$15,\"DCI\",B22,\"Conformité\",$E$1)<>0,GETPIVOTDATA(\"Nombre de Conformité2\",TCDDCICONF!$A$15,\"DCI\",B22,\"Conformité\",$E$1),\"\"),\"\")","v":""},{"$f":"IFERROR(IF(GETPIVOTDATA(\"Nombre de Conformité2\",TCDDCICONF!$A$15,\"DCI\",B22,\"Conformité\",$F$1)<>0,GETPIVOTDATA(\"Nombre de Conformité2\",TCDDCICONF!$A$15,\"DCI\",B22,\"Conformité\",$F$1),\"\"),\"\")","v":""},{"$f":"IFERROR(IF(GETPIVOTDATA(\"Nombre de Conformité2\",TCDDCICONF!$A$15,\"DCI\",B22,\"Conformité\",$G$1)<>0,GETPIVOTDATA(\"Nombre de Conformité2\",TCDDCICONF!$A$15,\"DCI\",B22,\"Conformité\",$G$1),\"\"),\"\")","v":""},{"$f":"IFERROR(IF(GETPIVOTDATA(\"Nombre de Conformité2\",TCDDCICONF!$A$15,\"DCI\",B22,\"Conformité\",$H$1)<>0,GETPIVOTDATA(\"Nombre de Conformité2\",TCDDCICONF!$A$15,\"DCI\",B22,\"Conformité\",$H$1),\"\"),\"\")","v":""},{"$f":"IFERROR(IF(GETPIVOTDATA(\"Nombre de Conformité2\",TCDDCICONF!$A$15,\"DCI\",B22,\"Conformité\",$I$1)<>0,GETPIVOTDATA(\"Nombre de Conformité2\",TCDDCICONF!$A$15,\"DCI\",B22,\"Conformité\",$I$1),\"\"),\"\")","v":""}]
[{"$f":"IFERROR(IF(INDEX(Référentiel_pour_Sphinx!$A$1:$F$110,MATCH(B23,Référentiel_pour_Sphinx!$A$1:$A$110,0),4)=0,\"\",INDEX(Référentiel_pour_Sphinx!$A$1:$F$110,MATCH(B23,Référentiel_pour_Sphinx!$A$1:$A$110,0),4)),\"\")","v":""},{"$f":"IF(TCDDCICONF!A39<>0,TCDDCICONF!A39,\"\")","v":""},{"$f":"IFERROR(GETPIVOTDATA(\"Conformité\",TCDDCICONF!$A$15,\"DCI\",B23),\"\")","v":""},{"$f":"IFERROR(IF(GETPIVOTDATA(\"Nombre de Conformité2\",TCDDCICONF!$A$15,\"DCI\",B23,\"Conformité\",$D$1)<>0,GETPIVOTDATA(\"Nombre de Conformité2\",TCDDCICONF!$A$15,\"DCI\",B23,\"Conformité\",$D$1),\"\"),\"\")","v":""},{"$f":"IFERROR(IF(GETPIVOTDATA(\"Nombre de Conformité2\",TCDDCICONF!$A$15,\"DCI\",B23,\"Conformité\",$E$1)<>0,GETPIVOTDATA(\"Nombre de Conformité2\",TCDDCICONF!$A$15,\"DCI\",B23,\"Conformité\",$E$1),\"\"),\"\")","v":""},{"$f":"IFERROR(IF(GETPIVOTDATA(\"Nombre de Conformité2\",TCDDCICONF!$A$15,\"DCI\",B23,\"Conformité\",$F$1)<>0,GETPIVOTDATA(\"Nombre de Conformité2\",TCDDCICONF!$A$15,\"DCI\",B23,\"Conformité\",$F$1),\"\"),\"\")","v":""},{"$f":"IFERROR(IF(GETPIVOTDATA(\"Nombre de Conformité2\",TCDDCICONF!$A$15,\"DCI\",B23,\"Conformité\",$G$1)<>0,GETPIVOTDATA(\"Nombre de Conformité2\",TCDDCICONF!$A$15,\"DCI\",B23,\"Conformité\",$G$1),\"\"),\"\")","v":""},{"$f":"IFERROR(IF(GETPIVOTDATA(\"Nombre de Conformité2\",TCDDCICONF!$A$15,\"DCI\",B23,\"Conformité\",$H$1)<>0,GETPIVOTDATA(\"Nombre de Conformité2\",TCDDCICONF!$A$15,\"DCI\",B23,\"Conformité\",$H$1),\"\"),\"\")","v":""},{"$f":"IFERROR(IF(GETPIVOTDATA(\"Nombre de Conformité2\",TCDDCICONF!$A$15,\"DCI\",B23,\"Conformité\",$I$1)<>0,GETPIVOTDATA(\"Nombre de Conformité2\",TCDDCICONF!$A$15,\"DCI\",B23,\"Conformité\",$I$1),\"\"),\"\")","v":""}]
[{"$f":"IFERROR(IF(INDEX(Référentiel_pour_Sphinx!$A$1:$F$110,MATCH(B24,Référentiel_pour_Sphinx!$A$1:$A$110,0),4)=0,\"\",INDEX(Référentiel_pour_Sphinx!$A$1:$F$110,MATCH(B24,Référentiel_pour_Sphinx!$A$1:$A$110,0),4)),\"\")","v":""},{"$f":"IF(TCDDCICONF!A40<>0,TCDDCICONF!A40,\"\")","v":""},{"$f":"IFERROR(GETPIVOTDATA(\"Conformité\",TCDDCICONF!$A$15,\"DCI\",B24),\"\")","v":""},{"$f":"IFERROR(IF(GETPIVOTDATA(\"Nombre de Conformité2\",TCDDCICONF!$A$15,\"DCI\",B24,\"Conformité\",$D$1)<>0,GETPIVOTDATA(\"Nombre de Conformité2\",TCDDCICONF!$A$15,\"DCI\",B24,\"Conformité\",$D$1),\"\"),\"\")","v":""},{"$f":"IFERROR(IF(GETPIVOTDATA(\"Nombre de Conformité2\",TCDDCICONF!$A$15,\"DCI\",B24,\"Conformité\",$E$1)<>0,GETPIVOTDATA(\"Nombre de Conformité2\",TCDDCICONF!$A$15,\"DCI\",B24,\"Conformité\",$E$1),\"\"),\"\")","v":""},{"$f":"IFERROR(IF(GETPIVOTDATA(\"Nombre de Conformité2\",TCDDCICONF!$A$15,\"DCI\",B24,\"Conformité\",$F$1)<>0,GETPIVOTDATA(\"Nombre de Conformité2\",TCDDCICONF!$A$15,\"DCI\",B24,\"Conformité\",$F$1),\"\"),\"\")","v":""},{"$f":"IFERROR(IF(GETPIVOTDATA(\"Nombre de Conformité2\",TCDDCICONF!$A$15,\"DCI\",B24,\"Conformité\",$G$1)<>0,GETPIVOTDATA(\"Nombre de Conformité2\",TCDDCICONF!$A$15,\"DCI\",B24,\"Conformité\",$G$1),\"\"),\"\")","v":""},{"$f":"IFERROR(IF(GETPIVOTDATA(\"Nombre de Conformité2\",TCDDCICONF!$A$15,\"DCI\",B24,\"Conformité\",$H$1)<>0,GETPIVOTDATA(\"Nombre de Conformité2\",TCDDCICONF!$A$15,\"DCI\",B24,\"Conformité\",$H$1),\"\"),\"\")","v":""},{"$f":"IFERROR(IF(GETPIVOTDATA(\"Nombre de Conformité2\",TCDDCICONF!$A$15,\"DCI\",B24,\"Conformité\",$I$1)<>0,GETPIVOTDATA(\"Nombre de Conformité2\",TCDDCICONF!$A$15,\"DCI\",B24,\"Conformité\",$I$1),\"\"),\"\")","v":""}]
[{"$f":"IFERROR(IF(INDEX(Référentiel_pour_Sphinx!$A$1:$F$110,MATCH(B25,Référentiel_pour_Sphinx!$A$1:$A$110,0),4)=0,\"\",INDEX(Référentiel_pour_Sphinx!$A$1:$F$110,MATCH(B25,Référentiel_pour_Sphinx!$A$1:$A$110,0),4)),\"\")","v":""},{"$f":"IF(TCDDCICONF!A41<>0,TCDDCICONF!A41,\"\")","v":""},{"$f":"IFERROR(GETPIVOTDATA(\"Conformité\",TCDDCICONF!$A$15,\"DCI\",B25),\"\")","v":""},{"$f":"IFERROR(IF(GETPIVOTDATA(\"Nombre de Conformité2\",TCDDCICONF!$A$15,\"DCI\",B25,\"Conformité\",$D$1)<>0,GETPIVOTDATA(\"Nombre de Conformité2\",TCDDCICONF!$A$15,\"DCI\",B25,\"Conformité\",$D$1),\"\"),\"\")","v":""},{"$f":"IFERROR(IF(GETPIVOTDATA(\"Nombre de Conformité2\",TCDDCICONF!$A$15,\"DCI\",B25,\"Conformité\",$E$1)<>0,GETPIVOTDATA(\"Nombre de Conformité2\",TCDDCICONF!$A$15,\"DCI\",B25,\"Conformité\",$E$1),\"\"),\"\")","v":""},{"$f":"IFERROR(IF(GETPIVOTDATA(\"Nombre de Conformité2\",TCDDCICONF!$A$15,\"DCI\",B25,\"Conformité\",$F$1)<>0,GETPIVOTDATA(\"Nombre de Conformité2\",TCDDCICONF!$A$15,\"DCI\",B25,\"Conformité\",$F$1),\"\"),\"\")","v":""},{"$f":"IFERROR(IF(GETPIVOTDATA(\"Nombre de Conformité2\",TCDDCICONF!$A$15,\"DCI\",B25,\"Conformité\",$G$1)<>0,GETPIVOTDATA(\"Nombre de Conformité2\",TCDDCICONF!$A$15,\"DCI\",B25,\"Conformité\",$G$1),\"\"),\"\")","v":""},{"$f":"IFERROR(IF(GETPIVOTDATA(\"Nombre de Conformité2\",TCDDCICONF!$A$15,\"DCI\",B25,\"Conformité\",$H$1)<>0,GETPIVOTDATA(\"Nombre de Conformité2\",TCDDCICONF!$A$15,\"DCI\",B25,\"Conformité\",$H$1),\"\"),\"\")","v":""},{"$f":"IFERROR(IF(GETPIVOTDATA(\"Nombre de Conformité2\",TCDDCICONF!$A$15,\"DCI\",B25,\"Conformité\",$I$1)<>0,GETPIVOTDATA(\"Nombre de Conformité2\",TCDDCICONF!$A$15,\"DCI\",B25,\"Conformité\",$I$1),\"\"),\"\")","v":""}]
[{"$f":"IFERROR(IF(INDEX(Référentiel_pour_Sphinx!$A$1:$F$110,MATCH(B26,Référentiel_pour_Sphinx!$A$1:$A$110,0),4)=0,\"\",INDEX(Référentiel_pour_Sphinx!$A$1:$F$110,MATCH(B26,Référentiel_pour_Sphinx!$A$1:$A$110,0),4)),\"\")","v":""},{"$f":"IF(TCDDCICONF!A42<>0,TCDDCICONF!A42,\"\")","v":""},{"$f":"IFERROR(GETPIVOTDATA(\"Conformité\",TCDDCICONF!$A$15,\"DCI\",B26),\"\")","v":""},{"$f":"IFERROR(IF(GETPIVOTDATA(\"Nombre de Conformité2\",TCDDCICONF!$A$15,\"DCI\",B26,\"Conformité\",$D$1)<>0,GETPIVOTDATA(\"Nombre de Conformité2\",TCDDCICONF!$A$15,\"DCI\",B26,\"Conformité\",$D$1),\"\"),\"\")","v":""},{"$f":"IFERROR(IF(GETPIVOTDATA(\"Nombre de Conformité2\",TCDDCICONF!$A$15,\"DCI\",B26,\"Conformité\",$E$1)<>0,GETPIVOTDATA(\"Nombre de Conformité2\",TCDDCICONF!$A$15,\"DCI\",B26,\"Conformité\",$E$1),\"\"),\"\")","v":""},{"$f":"IFERROR(IF(GETPIVOTDATA(\"Nombre de Conformité2\",TCDDCICONF!$A$15,\"DCI\",B26,\"Conformité\",$F$1)<>0,GETPIVOTDATA(\"Nombre de Conformité2\",TCDDCICONF!$A$15,\"DCI\",B26,\"Conformité\",$F$1),\"\"),\"\")","v":""},{"$f":"IFERROR(IF(GETPIVOTDATA(\"Nombre de Conformité2\",TCDDCICONF!$A$15,\"DCI\",B26,\"Conformité\",$G$1)<>0,GETPIVOTDATA(\"Nombre de Conformité2\",TCDDCICONF!$A$15,\"DCI\",B26,\"Conformité\",$G$1),\"\"),\"\")","v":""},{"$f":"IFERROR(IF(GETPIVOTDATA(\"Nombre de Conformité2\",TCDDCICONF!$A$15,\"DCI\",B26,\"Conformité\",$H$1)<>0,GETPIVOTDATA(\"Nombre de Conformité2\",TCDDCICONF!$A$15,\"DCI\",B26,\"Conformité\",$H$1),\"\"),\"\")","v":""},{"$f":"IFERROR(IF(GETPIVOTDATA(\"Nombre de Conformité2\",TCDDCICONF!$A$15,\"DCI\",B26,\"Conformité\",$I$1)<>0,GETPIVOTDATA(\"Nombre de Conformité2\",TCDDCICONF!$A$15,\"DCI\",B26,\"Conformité\",$I$1),\"\"),\"\")","v":""}]
[{"$f":"IFERROR(IF(INDEX(Référentiel_pour_Sphinx!$A$1:$F$110,MATCH(B27,Référentiel_pour_Sphinx!$A$1:$A$110,0),4)=0,\"\",INDEX(Référentiel_pour_Sphinx!$A$1:$F$110,MATCH(B27,Référentiel_pour_Sphinx!$A$1:$A$110,0),4)),\"\")","v":""},{"$f":"IF(TCDDCICONF!A43<>0,TCDDCICONF!A43,\"\")","v":""},{"$f":"IFERROR(GETPIVOTDATA(\"Conformité\",TCDDCICONF!$A$15,\"DCI\",B27),\"\")","v":""},{"$f":"IFERROR(IF(GETPIVOTDATA(\"Nombre de Conformité2\",TCDDCICONF!$A$15,\"DCI\",B27,\"Conformité\",$D$1)<>0,GETPIVOTDATA(\"Nombre de Conformité2\",TCDDCICONF!$A$15,\"DCI\",B27,\"Conformité\",$D$1),\"\"),\"\")","v":""},{"$f":"IFERROR(IF(GETPIVOTDATA(\"Nombre de Conformité2\",TCDDCICONF!$A$15,\"DCI\",B27,\"Conformité\",$E$1)<>0,GETPIVOTDATA(\"Nombre de Conformité2\",TCDDCICONF!$A$15,\"DCI\",B27,\"Conformité\",$E$1),\"\"),\"\")","v":""},{"$f":"IFERROR(IF(GETPIVOTDATA(\"Nombre de Conformité2\",TCDDCICONF!$A$15,\"DCI\",B27,\"Conformité\",$F$1)<>0,GETPIVOTDATA(\"Nombre de Conformité2\",TCDDCICONF!$A$15,\"DCI\",B27,\"Conformité\",$F$1),\"\"),\"\")","v":""},{"$f":"IFERROR(IF(GETPIVOTDATA(\"Nombre de Conformité2\",TCDDCICONF!$A$15,\"DCI\",B27,\"Conformité\",$G$1)<>0,GETPIVOTDATA(\"Nombre de Conformité2\",TCDDCICONF!$A$15,\"DCI\",B27,\"Conformité\",$G$1),\"\"),\"\")","v":""},{"$f":"IFERROR(IF(GETPIVOTDATA(\"Nombre de Conformité2\",TCDDCICONF!$A$15,\"DCI\",B27,\"Conformité\",$H$1)<>0,GETPIVOTDATA(\"Nombre de Conformité2\",TCDDCICONF!$A$15,\"DCI\",B27,\"Conformité\",$H$1),\"\"),\"\")","v":""},{"$f":"IFERROR(IF(GETPIVOTDATA(\"Nombre de Conformité2\",TCDDCICONF!$A$15,\"DCI\",B27,\"Conformité\",$I$1)<>0,GETPIVOTDATA(\"Nombre de Conformité2\",TCDDCICONF!$A$15,\"DCI\",B27,\"Conformité\",$I$1),\"\"),\"\")","v":""}]
[{"$f":"IFERROR(IF(INDEX(Référentiel_pour_Sphinx!$A$1:$F$110,MATCH(B28,Référentiel_pour_Sphinx!$A$1:$A$110,0),4)=0,\"\",INDEX(Référentiel_pour_Sphinx!$A$1:$F$110,MATCH(B28,Référentiel_pour_Sphinx!$A$1:$A$110,0),4)),\"\")","v":""},{"$f":"IF(TCDDCICONF!A44<>0,TCDDCICONF!A44,\"\")","v":""},{"$f":"IFERROR(GETPIVOTDATA(\"Conformité\",TCDDCICONF!$A$15,\"DCI\",B28),\"\")","v":""},{"$f":"IFERROR(IF(GETPIVOTDATA(\"Nombre de Conformité2\",TCDDCICONF!$A$15,\"DCI\",B28,\"Conformité\",$D$1)<>0,GETPIVOTDATA(\"Nombre de Conformité2\",TCDDCICONF!$A$15,\"DCI\",B28,\"Conformité\",$D$1),\"\"),\"\")","v":""},{"$f":"IFERROR(IF(GETPIVOTDATA(\"Nombre de Conformité2\",TCDDCICONF!$A$15,\"DCI\",B28,\"Conformité\",$E$1)<>0,GETPIVOTDATA(\"Nombre de Conformité2\",TCDDCICONF!$A$15,\"DCI\",B28,\"Conformité\",$E$1),\"\"),\"\")","v":""},{"$f":"IFERROR(IF(GETPIVOTDATA(\"Nombre de Conformité2\",TCDDCICONF!$A$15,\"DCI\",B28,\"Conformité\",$F$1)<>0,GETPIVOTDATA(\"Nombre de Conformité2\",TCDDCICONF!$A$15,\"DCI\",B28,\"Conformité\",$F$1),\"\"),\"\")","v":""},{"$f":"IFERROR(IF(GETPIVOTDATA(\"Nombre de Conformité2\",TCDDCICONF!$A$15,\"DCI\",B28,\"Conformité\",$G$1)<>0,GETPIVOTDATA(\"Nombre de Conformité2\",TCDDCICONF!$A$15,\"DCI\",B28,\"Conformité\",$G$1),\"\"),\"\")","v":""},{"$f":"IFERROR(IF(GETPIVOTDATA(\"Nombre de Conformité2\",TCDDCICONF!$A$15,\"DCI\",B28,\"Conformité\",$H$1)<>0,GETPIVOTDATA(\"Nombre de Conformité2\",TCDDCICONF!$A$15,\"DCI\",B28,\"Conformité\",$H$1),\"\"),\"\")","v":""},{"$f":"IFERROR(IF(GETPIVOTDATA(\"Nombre de Conformité2\",TCDDCICONF!$A$15,\"DCI\",B28,\"Conformité\",$I$1)<>0,GETPIVOTDATA(\"Nombre de Conformité2\",TCDDCICONF!$A$15,\"DCI\",B28,\"Conformité\",$I$1),\"\"),\"\")","v":""}]
[{"$f":"IFERROR(IF(INDEX(Référentiel_pour_Sphinx!$A$1:$F$110,MATCH(B29,Référentiel_pour_Sphinx!$A$1:$A$110,0),4)=0,\"\",INDEX(Référentiel_pour_Sphinx!$A$1:$F$110,MATCH(B29,Référentiel_pour_Sphinx!$A$1:$A$110,0),4)),\"\")","v":""},{"$f":"IF(TCDDCICONF!A45<>0,TCDDCICONF!A45,\"\")","v":""},{"$f":"IFERROR(GETPIVOTDATA(\"Conformité\",TCDDCICONF!$A$15,\"DCI\",B29),\"\")","v":""},{"$f":"IFERROR(IF(GETPIVOTDATA(\"Nombre de Conformité2\",TCDDCICONF!$A$15,\"DCI\",B29,\"Conformité\",$D$1)<>0,GETPIVOTDATA(\"Nombre de Conformité2\",TCDDCICONF!$A$15,\"DCI\",B29,\"Conformité\",$D$1),\"\"),\"\")","v":""},{"$f":"IFERROR(IF(GETPIVOTDATA(\"Nombre de Conformité2\",TCDDCICONF!$A$15,\"DCI\",B29,\"Conformité\",$E$1)<>0,GETPIVOTDATA(\"Nombre de Conformité2\",TCDDCICONF!$A$15,\"DCI\",B29,\"Conformité\",$E$1),\"\"),\"\")","v":""},{"$f":"IFERROR(IF(GETPIVOTDATA(\"Nombre de Conformité2\",TCDDCICONF!$A$15,\"DCI\",B29,\"Conformité\",$F$1)<>0,GETPIVOTDATA(\"Nombre de Conformité2\",TCDDCICONF!$A$15,\"DCI\",B29,\"Conformité\",$F$1),\"\"),\"\")","v":""},{"$f":"IFERROR(IF(GETPIVOTDATA(\"Nombre de Conformité2\",TCDDCICONF!$A$15,\"DCI\",B29,\"Conformité\",$G$1)<>0,GETPIVOTDATA(\"Nombre de Conformité2\",TCDDCICONF!$A$15,\"DCI\",B29,\"Conformité\",$G$1),\"\"),\"\")","v":""},{"$f":"IFERROR(IF(GETPIVOTDATA(\"Nombre de Conformité2\",TCDDCICONF!$A$15,\"DCI\",B29,\"Conformité\",$H$1)<>0,GETPIVOTDATA(\"Nombre de Conformité2\",TCDDCICONF!$A$15,\"DCI\",B29,\"Conformité\",$H$1),\"\"),\"\")","v":""},{"$f":"IFERROR(IF(GETPIVOTDATA(\"Nombre de Conformité2\",TCDDCICONF!$A$15,\"DCI\",B29,\"Conformité\",$I$1)<>0,GETPIVOTDATA(\"Nombre de Conformité2\",TCDDCICONF!$A$15,\"DCI\",B29,\"Conformité\",$I$1),\"\"),\"\")","v":""}]
[{"$f":"IFERROR(IF(INDEX(Référentiel_pour_Sphinx!$A$1:$F$110,MATCH(B30,Référentiel_pour_Sphinx!$A$1:$A$110,0),4)=0,\"\",INDEX(Référentiel_pour_Sphinx!$A$1:$F$110,MATCH(B30,Référentiel_pour_Sphinx!$A$1:$A$110,0),4)),\"\")","v":""},{"$f":"IF(TCDDCICONF!A46<>0,TCDDCICONF!A46,\"\")","v":""},{"$f":"IFERROR(GETPIVOTDATA(\"Conformité\",TCDDCICONF!$A$15,\"DCI\",B30),\"\")","v":""},{"$f":"IFERROR(IF(GETPIVOTDATA(\"Nombre de Conformité2\",TCDDCICONF!$A$15,\"DCI\",B30,\"Conformité\",$D$1)<>0,GETPIVOTDATA(\"Nombre de Conformité2\",TCDDCICONF!$A$15,\"DCI\",B30,\"Conformité\",$D$1),\"\"),\"\")","v":""},{"$f":"IFERROR(IF(GETPIVOTDATA(\"Nombre de Conformité2\",TCDDCICONF!$A$15,\"DCI\",B30,\"Conformité\",$E$1)<>0,GETPIVOTDATA(\"Nombre de Conformité2\",TCDDCICONF!$A$15,\"DCI\",B30,\"Conformité\",$E$1),\"\"),\"\")","v":""},{"$f":"IFERROR(IF(GETPIVOTDATA(\"Nombre de Conformité2\",TCDDCICONF!$A$15,\"DCI\",B30,\"Conformité\",$F$1)<>0,GETPIVOTDATA(\"Nombre de Conformité2\",TCDDCICONF!$A$15,\"DCI\",B30,\"Conformité\",$F$1),\"\"),\"\")","v":""},{"$f":"IFERROR(IF(GETPIVOTDATA(\"Nombre de Conformité2\",TCDDCICONF!$A$15,\"DCI\",B30,\"Conformité\",$G$1)<>0,GETPIVOTDATA(\"Nombre de Conformité2\",TCDDCICONF!$A$15,\"DCI\",B30,\"Conformité\",$G$1),\"\"),\"\")","v":""},{"$f":"IFERROR(IF(GETPIVOTDATA(\"Nombre de Conformité2\",TCDDCICONF!$A$15,\"DCI\",B30,\"Conformité\",$H$1)<>0,GETPIVOTDATA(\"Nombre de Conformité2\",TCDDCICONF!$A$15,\"DCI\",B30,\"Conformité\",$H$1),\"\"),\"\")","v":""},{"$f":"IFERROR(IF(GETPIVOTDATA(\"Nombre de Conformité2\",TCDDCICONF!$A$15,\"DCI\",B30,\"Conformité\",$I$1)<>0,GETPIVOTDATA(\"Nombre de Conformité2\",TCDDCICONF!$A$15,\"DCI\",B30,\"Conformité\",$I$1),\"\"),\"\")","v":""}]
[{"$f":"IFERROR(IF(INDEX(Référentiel_pour_Sphinx!$A$1:$F$110,MATCH(B31,Référentiel_pour_Sphinx!$A$1:$A$110,0),4)=0,\"\",INDEX(Référentiel_pour_Sphinx!$A$1:$F$110,MATCH(B31,Référentiel_pour_Sphinx!$A$1:$A$110,0),4)),\"\")","v":""},{"$f":"IF(TCDDCICONF!A47<>0,TCDDCICONF!A47,\"\")","v":""},{"$f":"IFERROR(GETPIVOTDATA(\"Conformité\",TCDDCICONF!$A$15,\"DCI\",B31),\"\")","v":""},{"$f":"IFERROR(IF(GETPIVOTDATA(\"Nombre de Conformité2\",TCDDCICONF!$A$15,\"DCI\",B31,\"Conformité\",$D$1)<>0,GETPIVOTDATA(\"Nombre de Conformité2\",TCDDCICONF!$A$15,\"DCI\",B31,\"Conformité\",$D$1),\"\"),\"\")","v":""},{"$f":"IFERROR(IF(GETPIVOTDATA(\"Nombre de Conformité2\",TCDDCICONF!$A$15,\"DCI\",B31,\"Conformité\",$E$1)<>0,GETPIVOTDATA(\"Nombre de Conformité2\",TCDDCICONF!$A$15,\"DCI\",B31,\"Conformité\",$E$1),\"\"),\"\")","v":""},{"$f":"IFERROR(IF(GETPIVOTDATA(\"Nombre de Conformité2\",TCDDCICONF!$A$15,\"DCI\",B31,\"Conformité\",$F$1)<>0,GETPIVOTDATA(\"Nombre de Conformité2\",TCDDCICONF!$A$15,\"DCI\",B31,\"Conformité\",$F$1),\"\"),\"\")","v":""},{"$f":"IFERROR(IF(GETPIVOTDATA(\"Nombre de Conformité2\",TCDDCICONF!$A$15,\"DCI\",B31,\"Conformité\",$G$1)<>0,GETPIVOTDATA(\"Nombre de Conformité2\",TCDDCICONF!$A$15,\"DCI\",B31,\"Conformité\",$G$1),\"\"),\"\")","v":""},{"$f":"IFERROR(IF(GETPIVOTDATA(\"Nombre de Conformité2\",TCDDCICONF!$A$15,\"DCI\",B31,\"Conformité\",$H$1)<>0,GETPIVOTDATA(\"Nombre de Conformité2\",TCDDCICONF!$A$15,\"DCI\",B31,\"Conformité\",$H$1),\"\"),\"\")","v":""},{"$f":"IFERROR(IF(GETPIVOTDATA(\"Nombre de Conformité2\",TCDDCICONF!$A$15,\"DCI\",B31,\"Conformité\",$I$1)<>0,GETPIVOTDATA(\"Nombre de Conformité2\",TCDDCICONF!$A$15,\"DCI\",B31,\"Conformité\",$I$1),\"\"),\"\")","v":""}]
[{"$f":"IFERROR(IF(INDEX(Référentiel_pour_Sphinx!$A$1:$F$110,MATCH(B32,Référentiel_pour_Sphinx!$A$1:$A$110,0),4)=0,\"\",INDEX(Référentiel_pour_Sphinx!$A$1:$F$110,MATCH(B32,Référentiel_pour_Sphinx!$A$1:$A$110,0),4)),\"\")","v":""},{"$f":"IF(TCDDCICONF!A48<>0,TCDDCICONF!A48,\"\")","v":""},{"$f":"IFERROR(GETPIVOTDATA(\"Conformité\",TCDDCICONF!$A$15,\"DCI\",B32),\"\")","v":""},{"$f":"IFERROR(IF(GETPIVOTDATA(\"Nombre de Conformité2\",TCDDCICONF!$A$15,\"DCI\",B32,\"Conformité\",$D$1)<>0,GETPIVOTDATA(\"Nombre de Conformité2\",TCDDCICONF!$A$15,\"DCI\",B32,\"Conformité\",$D$1),\"\"),\"\")","v":""},{"$f":"IFERROR(IF(GETPIVOTDATA(\"Nombre de Conformité2\",TCDDCICONF!$A$15,\"DCI\",B32,\"Conformité\",$E$1)<>0,GETPIVOTDATA(\"Nombre de Conformité2\",TCDDCICONF!$A$15,\"DCI\",B32,\"Conformité\",$E$1),\"\"),\"\")","v":""},{"$f":"IFERROR(IF(GETPIVOTDATA(\"Nombre de Conformité2\",TCDDCICONF!$A$15,\"DCI\",B32,\"Conformité\",$F$1)<>0,GETPIVOTDATA(\"Nombre de Conformité2\",TCDDCICONF!$A$15,\"DCI\",B32,\"Conformité\",$F$1),\"\"),\"\")","v":""},{"$f":"IFERROR(IF(GETPIVOTDATA(\"Nombre de Conformité2\",TCDDCICONF!$A$15,\"DCI\",B32,\"Conformité\",$G$1)<>0,GETPIVOTDATA(\"Nombre de Conformité2\",TCDDCICONF!$A$15,\"DCI\",B32,\"Conformité\",$G$1),\"\"),\"\")","v":""},{"$f":"IFERROR(IF(GETPIVOTDATA(\"Nombre de Conformité2\",TCDDCICONF!$A$15,\"DCI\",B32,\"Conformité\",$H$1)<>0,GETPIVOTDATA(\"Nombre de Conformité2\",TCDDCICONF!$A$15,\"DCI\",B32,\"Conformité\",$H$1),\"\"),\"\")","v":""},{"$f":"IFERROR(IF(GETPIVOTDATA(\"Nombre de Conformité2\",TCDDCICONF!$A$15,\"DCI\",B32,\"Conformité\",$I$1)<>0,GETPIVOTDATA(\"Nombre de Conformité2\",TCDDCICONF!$A$15,\"DCI\",B32,\"Conformité\",$I$1),\"\"),\"\")","v":""}]
[{"$f":"IFERROR(IF(INDEX(Référentiel_pour_Sphinx!$A$1:$F$110,MATCH(B33,Référentiel_pour_Sphinx!$A$1:$A$110,0),4)=0,\"\",INDEX(Référentiel_pour_Sphinx!$A$1:$F$110,MATCH(B33,Référentiel_pour_Sphinx!$A$1:$A$110,0),4)),\"\")","v":""},{"$f":"IF(TCDDCICONF!A49<>0,TCDDCICONF!A49,\"\")","v":""},{"$f":"IFERROR(GETPIVOTDATA(\"Conformité\",TCDDCICONF!$A$15,\"DCI\",B33),\"\")","v":""},{"$f":"IFERROR(IF(GETPIVOTDATA(\"Nombre de Conformité2\",TCDDCICONF!$A$15,\"DCI\",B33,\"Conformité\",$D$1)<>0,GETPIVOTDATA(\"Nombre de Conformité2\",TCDDCICONF!$A$15,\"DCI\",B33,\"Conformité\",$D$1),\"\"),\"\")","v":""},{"$f":"IFERROR(IF(GETPIVOTDATA(\"Nombre de Conformité2\",TCDDCICONF!$A$15,\"DCI\",B33,\"Conformité\",$E$1)<>0,GETPIVOTDATA(\"Nombre de Conformité2\",TCDDCICONF!$A$15,\"DCI\",B33,\"Conformité\",$E$1),\"\"),\"\")","v":""},{"$f":"IFERROR(IF(GETPIVOTDATA(\"Nombre de Conformité2\",TCDDCICONF!$A$15,\"DCI\",B33,\"Conformité\",$F$1)<>0,GETPIVOTDATA(\"Nombre de Conformité2\",TCDDCICONF!$A$15,\"DCI\",B33,\"Conformité\",$F$1),\"\"),\"\")","v":""},{"$f":"IFERROR(IF(GETPIVOTDATA(\"Nombre de Conformité2\",TCDDCICONF!$A$15,\"DCI\",B33,\"Conformité\",$G$1)<>0,GETPIVOTDATA(\"Nombre de Conformité2\",TCDDCICONF!$A$15,\"DCI\",B33,\"Conformité\",$G$1),\"\"),\"\")","v":""},{"$f":"IFERROR(IF(GETPIVOTDATA(\"Nombre de Conformité2\",TCDDCICONF!$A$15,\"DCI\",B33,\"Conformité\",$H$1)<>0,GETPIVOTDATA(\"Nombre de Conformité2\",TCDDCICONF!$A$15,\"DCI\",B33,\"Conformité\",$H$1),\"\"),\"\")","v":""},{"$f":"IFERROR(IF(GETPIVOTDATA(\"Nombre de Conformité2\",TCDDCICONF!$A$15,\"DCI\",B33,\"Conformité\",$I$1)<>0,GETPIVOTDATA(\"Nombre de Conformité2\",TCDDCICONF!$A$15,\"DCI\",B33,\"Conformité\",$I$1),\"\"),\"\")","v":""}]
[{"$f":"IFERROR(IF(INDEX(Référentiel_pour_Sphinx!$A$1:$F$110,MATCH(B34,Référentiel_pour_Sphinx!$A$1:$A$110,0),4)=0,\"\",INDEX(Référentiel_pour_Sphinx!$A$1:$F$110,MATCH(B34,Référentiel_pour_Sphinx!$A$1:$A$110,0),4)),\"\")","v":""},{"$f":"IF(TCDDCICONF!A50<>0,TCDDCICONF!A50,\"\")","v":""},{"$f":"IFERROR(GETPIVOTDATA(\"Conformité\",TCDDCICONF!$A$15,\"DCI\",B34),\"\")","v":""},{"$f":"IFERROR(IF(GETPIVOTDATA(\"Nombre de Conformité2\",TCDDCICONF!$A$15,\"DCI\",B34,\"Conformité\",$D$1)<>0,GETPIVOTDATA(\"Nombre de Conformité2\",TCDDCICONF!$A$15,\"DCI\",B34,\"Conformité\",$D$1),\"\"),\"\")","v":""},{"$f":"IFERROR(IF(GETPIVOTDATA(\"Nombre de Conformité2\",TCDDCICONF!$A$15,\"DCI\",B34,\"Conformité\",$E$1)<>0,GETPIVOTDATA(\"Nombre de Conformité2\",TCDDCICONF!$A$15,\"DCI\",B34,\"Conformité\",$E$1),\"\"),\"\")","v":""},{"$f":"IFERROR(IF(GETPIVOTDATA(\"Nombre de Conformité2\",TCDDCICONF!$A$15,\"DCI\",B34,\"Conformité\",$F$1)<>0,GETPIVOTDATA(\"Nombre de Conformité2\",TCDDCICONF!$A$15,\"DCI\",B34,\"Conformité\",$F$1),\"\"),\"\")","v":""},{"$f":"IFERROR(IF(GETPIVOTDATA(\"Nombre de Conformité2\",TCDDCICONF!$A$15,\"DCI\",B34,\"Conformité\",$G$1)<>0,GETPIVOTDATA(\"Nombre de Conformité2\",TCDDCICONF!$A$15,\"DCI\",B34,\"Conformité\",$G$1),\"\"),\"\")","v":""},{"$f":"IFERROR(IF(GETPIVOTDATA(\"Nombre de Conformité2\",TCDDCICONF!$A$15,\"DCI\",B34,\"Conformité\",$H$1)<>0,GETPIVOTDATA(\"Nombre de Conformité2\",TCDDCICONF!$A$15,\"DCI\",B34,\"Conformité\",$H$1),\"\"),\"\")","v":""},{"$f":"IFERROR(IF(GETPIVOTDATA(\"Nombre de Conformité2\",TCDDCICONF!$A$15,\"DCI\",B34,\"Conformité\",$I$1)<>0,GETPIVOTDATA(\"Nombre de Conformité2\",TCDDCICONF!$A$15,\"DCI\",B34,\"Conformité\",$I$1),\"\"),\"\")","v":""}]
[{"$f":"IFERROR(IF(INDEX(Référentiel_pour_Sphinx!$A$1:$F$110,MATCH(B35,Référentiel_pour_Sphinx!$A$1:$A$110,0),4)=0,\"\",INDEX(Référentiel_pour_Sphinx!$A$1:$F$110,MATCH(B35,Référentiel_pour_Sphinx!$A$1:$A$110,0),4)),\"\")","v":""},{"$f":"IF(TCDDCICONF!A51<>0,TCDDCICONF!A51,\"\")","v":""},{"$f":"IFERROR(GETPIVOTDATA(\"Conformité\",TCDDCICONF!$A$15,\"DCI\",B35),\"\")","v":""},{"$f":"IFERROR(IF(GETPIVOTDATA(\"Nombre de Conformité2\",TCDDCICONF!$A$15,\"DCI\",B35,\"Conformité\",$D$1)<>0,GETPIVOTDATA(\"Nombre de Conformité2\",TCDDCICONF!$A$15,\"DCI\",B35,\"Conformité\",$D$1),\"\"),\"\")","v":""},{"$f":"IFERROR(IF(GETPIVOTDATA(\"Nombre de Conformité2\",TCDDCICONF!$A$15,\"DCI\",B35,\"Conformité\",$E$1)<>0,GETPIVOTDATA(\"Nombre de Conformité2\",TCDDCICONF!$A$15,\"DCI\",B35,\"Conformité\",$E$1),\"\"),\"\")","v":""},{"$f":"IFERROR(IF(GETPIVOTDATA(\"Nombre de Conformité2\",TCDDCICONF!$A$15,\"DCI\",B35,\"Conformité\",$F$1)<>0,GETPIVOTDATA(\"Nombre de Conformité2\",TCDDCICONF!$A$15,\"DCI\",B35,\"Conformité\",$F$1),\"\"),\"\")","v":""},{"$f":"IFERROR(IF(GETPIVOTDATA(\"Nombre de Conformité2\",TCDDCICONF!$A$15,\"DCI\",B35,\"Conformité\",$G$1)<>0,GETPIVOTDATA(\"Nombre de Conformité2\",TCDDCICONF!$A$15,\"DCI\",B35,\"Conformité\",$G$1),\"\"),\"\")","v":""},{"$f":"IFERROR(IF(GETPIVOTDATA(\"Nombre de Conformité2\",TCDDCICONF!$A$15,\"DCI\",B35,\"Conformité\",$H$1)<>0,GETPIVOTDATA(\"Nombre de Conformité2\",TCDDCICONF!$A$15,\"DCI\",B35,\"Conformité\",$H$1),\"\"),\"\")","v":""},{"$f":"IFERROR(IF(GETPIVOTDATA(\"Nombre de Conformité2\",TCDDCICONF!$A$15,\"DCI\",B35,\"Conformité\",$I$1)<>0,GETPIVOTDATA(\"Nombre de Conformité2\",TCDDCICONF!$A$15,\"DCI\",B35,\"Conformité\",$I$1),\"\"),\"\")","v":""}]
[{"$f":"IFERROR(IF(INDEX(Référentiel_pour_Sphinx!$A$1:$F$110,MATCH(B36,Référentiel_pour_Sphinx!$A$1:$A$110,0),4)=0,\"\",INDEX(Référentiel_pour_Sphinx!$A$1:$F$110,MATCH(B36,Référentiel_pour_Sphinx!$A$1:$A$110,0),4)),\"\")","v":""},{"$f":"IF(TCDDCICONF!A52<>0,TCDDCICONF!A52,\"\")","v":""},{"$f":"IFERROR(GETPIVOTDATA(\"Conformité\",TCDDCICONF!$A$15,\"DCI\",B36),\"\")","v":""},{"$f":"IFERROR(IF(GETPIVOTDATA(\"Nombre de Conformité2\",TCDDCICONF!$A$15,\"DCI\",B36,\"Conformité\",$D$1)<>0,GETPIVOTDATA(\"Nombre de Conformité2\",TCDDCICONF!$A$15,\"DCI\",B36,\"Conformité\",$D$1),\"\"),\"\")","v":""},{"$f":"IFERROR(IF(GETPIVOTDATA(\"Nombre de Conformité2\",TCDDCICONF!$A$15,\"DCI\",B36,\"Conformité\",$E$1)<>0,GETPIVOTDATA(\"Nombre de Conformité2\",TCDDCICONF!$A$15,\"DCI\",B36,\"Conformité\",$E$1),\"\"),\"\")","v":""},{"$f":"IFERROR(IF(GETPIVOTDATA(\"Nombre de Conformité2\",TCDDCICONF!$A$15,\"DCI\",B36,\"Conformité\",$F$1)<>0,GETPIVOTDATA(\"Nombre de Conformité2\",TCDDCICONF!$A$15,\"DCI\",B36,\"Conformité\",$F$1),\"\"),\"\")","v":""},{"$f":"IFERROR(IF(GETPIVOTDATA(\"Nombre de Conformité2\",TCDDCICONF!$A$15,\"DCI\",B36,\"Conformité\",$G$1)<>0,GETPIVOTDATA(\"Nombre de Conformité2\",TCDDCICONF!$A$15,\"DCI\",B36,\"Conformité\",$G$1),\"\"),\"\")","v":""},{"$f":"IFERROR(IF(GETPIVOTDATA(\"Nombre de Conformité2\",TCDDCICONF!$A$15,\"DCI\",B36,\"Conformité\",$H$1)<>0,GETPIVOTDATA(\"Nombre de Conformité2\",TCDDCICONF!$A$15,\"DCI\",B36,\"Conformité\",$H$1),\"\"),\"\")","v":""},{"$f":"IFERROR(IF(GETPIVOTDATA(\"Nombre de Conformité2\",TCDDCICONF!$A$15,\"DCI\",B36,\"Conformité\",$I$1)<>0,GETPIVOTDATA(\"Nombre de Conformité2\",TCDDCICONF!$A$15,\"DCI\",B36,\"Conformité\",$I$1),\"\"),\"\")","v":""}]
[{"$f":"IFERROR(IF(INDEX(Référentiel_pour_Sphinx!$A$1:$F$110,MATCH(B37,Référentiel_pour_Sphinx!$A$1:$A$110,0),4)=0,\"\",INDEX(Référentiel_pour_Sphinx!$A$1:$F$110,MATCH(B37,Référentiel_pour_Sphinx!$A$1:$A$110,0),4)),\"\")","v":""},{"$f":"IF(TCDDCICONF!A53<>0,TCDDCICONF!A53,\"\")","v":""},{"$f":"IFERROR(GETPIVOTDATA(\"Conformité\",TCDDCICONF!$A$15,\"DCI\",B37),\"\")","v":""},{"$f":"IFERROR(IF(GETPIVOTDATA(\"Nombre de Conformité2\",TCDDCICONF!$A$15,\"DCI\",B37,\"Conformité\",$D$1)<>0,GETPIVOTDATA(\"Nombre de Conformité2\",TCDDCICONF!$A$15,\"DCI\",B37,\"Conformité\",$D$1),\"\"),\"\")","v":""},{"$f":"IFERROR(IF(GETPIVOTDATA(\"Nombre de Conformité2\",TCDDCICONF!$A$15,\"DCI\",B37,\"Conformité\",$E$1)<>0,GETPIVOTDATA(\"Nombre de Conformité2\",TCDDCICONF!$A$15,\"DCI\",B37,\"Conformité\",$E$1),\"\"),\"\")","v":""},{"$f":"IFERROR(IF(GETPIVOTDATA(\"Nombre de Conformité2\",TCDDCICONF!$A$15,\"DCI\",B37,\"Conformité\",$F$1)<>0,GETPIVOTDATA(\"Nombre de Conformité2\",TCDDCICONF!$A$15,\"DCI\",B37,\"Conformité\",$F$1),\"\"),\"\")","v":""},{"$f":"IFERROR(IF(GETPIVOTDATA(\"Nombre de Conformité2\",TCDDCICONF!$A$15,\"DCI\",B37,\"Conformité\",$G$1)<>0,GETPIVOTDATA(\"Nombre de Conformité2\",TCDDCICONF!$A$15,\"DCI\",B37,\"Conformité\",$G$1),\"\"),\"\")","v":""},{"$f":"IFERROR(IF(GETPIVOTDATA(\"Nombre de Conformité2\",TCDDCICONF!$A$15,\"DCI\",B37,\"Conformité\",$H$1)<>0,GETPIVOTDATA(\"Nombre de Conformité2\",TCDDCICONF!$A$15,\"DCI\",B37,\"Conformité\",$H$1),\"\"),\"\")","v":""},{"$f":"IFERROR(IF(GETPIVOTDATA(\"Nombre de Conformité2\",TCDDCICONF!$A$15,\"DCI\",B37,\"Conformité\",$I$1)<>0,GETPIVOTDATA(\"Nombre de Conformité2\",TCDDCICONF!$A$15,\"DCI\",B37,\"Conformité\",$I$1),\"\"),\"\")","v":""}]
[{"$f":"IFERROR(IF(INDEX(Référentiel_pour_Sphinx!$A$1:$F$110,MATCH(B38,Référentiel_pour_Sphinx!$A$1:$A$110,0),4)=0,\"\",INDEX(Référentiel_pour_Sphinx!$A$1:$F$110,MATCH(B38,Référentiel_pour_Sphinx!$A$1:$A$110,0),4)),\"\")","v":""},{"$f":"IF(TCDDCICONF!A54<>0,TCDDCICONF!A54,\"\")","v":""},{"$f":"IFERROR(GETPIVOTDATA(\"Conformité\",TCDDCICONF!$A$15,\"DCI\",B38),\"\")","v":""},{"$f":"IFERROR(IF(GETPIVOTDATA(\"Nombre de Conformité2\",TCDDCICONF!$A$15,\"DCI\",B38,\"Conformité\",$D$1)<>0,GETPIVOTDATA(\"Nombre de Conformité2\",TCDDCICONF!$A$15,\"DCI\",B38,\"Conformité\",$D$1),\"\"),\"\")","v":""},{"$f":"IFERROR(IF(GETPIVOTDATA(\"Nombre de Conformité2\",TCDDCICONF!$A$15,\"DCI\",B38,\"Conformité\",$E$1)<>0,GETPIVOTDATA(\"Nombre de Conformité2\",TCDDCICONF!$A$15,\"DCI\",B38,\"Conformité\",$E$1),\"\"),\"\")","v":""},{"$f":"IFERROR(IF(GETPIVOTDATA(\"Nombre de Conformité2\",TCDDCICONF!$A$15,\"DCI\",B38,\"Conformité\",$F$1)<>0,GETPIVOTDATA(\"Nombre de Conformité2\",TCDDCICONF!$A$15,\"DCI\",B38,\"Conformité\",$F$1),\"\"),\"\")","v":""},{"$f":"IFERROR(IF(GETPIVOTDATA(\"Nombre de Conformité2\",TCDDCICONF!$A$15,\"DCI\",B38,\"Conformité\",$G$1)<>0,GETPIVOTDATA(\"Nombre de Conformité2\",TCDDCICONF!$A$15,\"DCI\",B38,\"Conformité\",$G$1),\"\"),\"\")","v":""},{"$f":"IFERROR(IF(GETPIVOTDATA(\"Nombre de Conformité2\",TCDDCICONF!$A$15,\"DCI\",B38,\"Conformité\",$H$1)<>0,GETPIVOTDATA(\"Nombre de Conformité2\",TCDDCICONF!$A$15,\"DCI\",B38,\"Conformité\",$H$1),\"\"),\"\")","v":""},{"$f":"IFERROR(IF(GETPIVOTDATA(\"Nombre de Conformité2\",TCDDCICONF!$A$15,\"DCI\",B38,\"Conformité\",$I$1)<>0,GETPIVOTDATA(\"Nombre de Conformité2\",TCDDCICONF!$A$15,\"DCI\",B38,\"Conformité\",$I$1),\"\"),\"\")","v":""}]
[{"$f":"IFERROR(IF(INDEX(Référentiel_pour_Sphinx!$A$1:$F$110,MATCH(B39,Référentiel_pour_Sphinx!$A$1:$A$110,0),4)=0,\"\",INDEX(Référentiel_pour_Sphinx!$A$1:$F$110,MATCH(B39,Référentiel_pour_Sphinx!$A$1:$A$110,0),4)),\"\")","v":""},{"$f":"IF(TCDDCICONF!A55<>0,TCDDCICONF!A55,\"\")","v":""},{"$f":"IFERROR(GETPIVOTDATA(\"Conformité\",TCDDCICONF!$A$15,\"DCI\",B39),\"\")","v":""},{"$f":"IFERROR(IF(GETPIVOTDATA(\"Nombre de Conformité2\",TCDDCICONF!$A$15,\"DCI\",B39,\"Conformité\",$D$1)<>0,GETPIVOTDATA(\"Nombre de Conformité2\",TCDDCICONF!$A$15,\"DCI\",B39,\"Conformité\",$D$1),\"\"),\"\")","v":""},{"$f":"IFERROR(IF(GETPIVOTDATA(\"Nombre de Conformité2\",TCDDCICONF!$A$15,\"DCI\",B39,\"Conformité\",$E$1)<>0,GETPIVOTDATA(\"Nombre de Conformité2\",TCDDCICONF!$A$15,\"DCI\",B39,\"Conformité\",$E$1),\"\"),\"\")","v":""},{"$f":"IFERROR(IF(GETPIVOTDATA(\"Nombre de Conformité2\",TCDDCICONF!$A$15,\"DCI\",B39,\"Conformité\",$F$1)<>0,GETPIVOTDATA(\"Nombre de Conformité2\",TCDDCICONF!$A$15,\"DCI\",B39,\"Conformité\",$F$1),\"\"),\"\")","v":""},{"$f":"IFERROR(IF(GETPIVOTDATA(\"Nombre de Conformité2\",TCDDCICONF!$A$15,\"DCI\",B39,\"Conformité\",$G$1)<>0,GETPIVOTDATA(\"Nombre de Conformité2\",TCDDCICONF!$A$15,\"DCI\",B39,\"Conformité\",$G$1),\"\"),\"\")","v":""},{"$f":"IFERROR(IF(GETPIVOTDATA(\"Nombre de Conformité2\",TCDDCICONF!$A$15,\"DCI\",B39,\"Conformité\",$H$1)<>0,GETPIVOTDATA(\"Nombre de Conformité2\",TCDDCICONF!$A$15,\"DCI\",B39,\"Conformité\",$H$1),\"\"),\"\")","v":""},{"$f":"IFERROR(IF(GETPIVOTDATA(\"Nombre de Conformité2\",TCDDCICONF!$A$15,\"DCI\",B39,\"Conformité\",$I$1)<>0,GETPIVOTDATA(\"Nombre de Conformité2\",TCDDCICONF!$A$15,\"DCI\",B39,\"Conformité\",$I$1),\"\"),\"\")","v":""}]

{"sheet":"TCDDCICONF","index":7,"n_rows":18,"n_cols":5,"rows_kept":18,"cut":false,"hidden":true,"merged":[]}
[]
[]
[]
[]
[]
[]
[]
[]
[]
[]
[]
[]
[]
[]
[null,"Conformité","Valeurs"]
[null,"(vide)","(vide)","Total Nombre de Conformité","Total Nombre de Conformité2"]
["DCI","Nombre de Conformité","Nombre de Conformité2"]
["(vide)",null,{"$error":"#DIV/0!"},null,{"$error":"#DIV/0!"}]

{"sheet":"GBP V4","index":8,"n_rows":48,"n_cols":24,"rows_kept":48,"cut":false,"hidden":true,"merged":[]}
["DCI","Conditions de prescription et de délivrance ","Reconstitution\n(solvant et volume)","Posologie (dose et fréquence de perfusion)","Voie","Dilution","Mode d’administration préconisé dans le cadre d'une administration par perfusion ","Mode d’administration alternatif","Orientation vers SAE","Commentaire","Autres voies d'administration injectables (hors Perfadom)","RCP1 IVD","RCP2 SC","RCP3 IM","RCP6 autres","Références bibliographiques","Références revu MT","RefBib1","RefBib2","RefBib3","RefBib4","RefBib5","RefBib6","Conditions de prescription et de délivrance "]
["CLASSE ATC ANTI INFECTIEUX A USAGE SYSTEMIQUE",null,null,null,null,null,null,null,null,null,null,null,null,null,null,null,""]
["Amikacine","Ville et hôpital : rétrocession\nPH","EPPI \n1g dans 5mL\n500 mg dans 4mL\n250mg dans 2mL\nOu prêt a l'emploi\n","25 à 30 mg/kg en perfusion de 30 min en dose unique journalière","IV \n","NaCl 0.9%\nCmax 10 mg/mL\n","Gravité 30 min",null,"non","\nIndex thérapeutique étroit\nEfficacité concentration dépendante\nSurveillance : Dosage pic plasmatique si besoin et concentrations résiduelles si durée > 5 jours ou IR\n","Voie IM possible. La voie intramusculaire est à éviter dans la mesure du possible, mais peut être pratiquée à titre exceptionnel en tenant compte que cette voie n'offre pas les mêmes garanties que la voie intraveineuse.",0,0,"X La voie intramusculaire est à éviter dans la mesure du possible, mais peut être pratiquée à titre exceptionnel en tenant compte que cette voie n'offre pas les mêmes garanties que la voie intraveineuse.",0,"RCP\nDISPO\nPOSO\nAN1",null,"RCP","DISPO","POSO","AN1",null,null,"Prescription Hospitalière\nDisponible en ville "]
["Amoxicilline","Ville","EPPI\n1g dans 20 mL\n2g dans 40 mL","Posologie standard : \n50 à 100 mg/kg/j toutes les 6 à 8 h\n                                                                                     \nForte posologie :\nAdministration discontinue : \n100 à 200mg/kg/j toutes les 4h en perfusion de 30 min\n\nAdministration continue : \n100 à 200mg/kg/j après une dose de charge de 2g sur 1 heure\n\nNE PAS DEPASSER 12g/j","IV","Si administration discontinue ou perfusion continue : NaCl 0,9% \nCmax 20 mg/mL","En cas d'administration discontinue :\nGravité 30 min\nEn cas de perfusion continue et en fonction de la mobilité du patient :\nPompe sur 12h (respecter la Cmax)",null,"instabilité en diffuseur","Mode d'administration par diffuseur non recommandé compte-tenu de l'absence de données de stabilité physico-chimiques à 37°C\nHyperhydratation si > 2g par perfusion pour diminuer le risque de cristallurie\n","Voies IM et IVD lente ","X",0,"X",0,"RCP\nDISPO\nPOSO\nSTAB\nAMX1","","RCP","DISPO","POSO","STAB","AMX1",null,"Disponible en ville"]
["Amoxicilline- acide clavulanique","Ville","EPPI\n1g dans 20 mL\n2g dans 20 mL","Posologie standard : \n1g/0,2g toutes les 8 à 6h en perfusion de 30 min\n                                                                                                \nForte posologie :\n2g/0,2g toutes les 8h en perfusion de 30 min","IV","1g ou 2g : si gravité : NaCl 0,9% 100 mL\nCmax 20 mg/mL","Gravité 30 min\n",null,"non","Stabilité altérée avec le G5%\nDurée max de perfusion : 60 min\nNe pas dépasser 1200 mg/j d’acide clavulanique/j (attention : présentation à 1 g/200mg et 2 g/200mg)\n","Voie IVD lente ","X",0,0,0,"RCP\nDISPO\nPOSO\nDiamantis et al","","RCP","DISPO","POSO","Diamantis et al",null,null,"Disponible en ville"]
["Amphotericine B \nFUNGIZONE","Hôpital : rétrocession \nPH ","EPPI\n50 mg dans 10mL","Dose-test initiale de 1 mg puis 0,3 mg/kg 1 fois par jour\nLa dose peut éventuellement être augmentée en fonction de la situation clinique du patient.","IV","Glucose 5%\nINCOMPATIBLE NaCl\nDose test : 1 mg dans 20 mL de G5%\nPerfusion : Cmax 0,1mg/mL","Dose test : IV lente (20-30 minutes) \nPompe administration en 2 à 6h","Gravité 2 à 6 heures si envisageable","instabilité en diffuseur","Ce médicament ne doit pas être administré par une ligne intraveineuse ayant contenu du chlorure de sodium à 0,9 % sauf si cette ligne a d'abord été rincée avec une solution injectable de glucose\nCompte-tenu des risques allergiques, une dose-test initiale (1 mg dans 20 mL de soluté glucose à 5 %) peut être administrée par voie intraveineuse pendant 20 à 30 minutes. La température, le pouls, la respiration et la pression artérielle seront enregistrés toutes les 30 minutes pendant 2 à 3 heures.\nUne filtration membranaire \"in-line\" peut être utilisée pour la perfusion; cependant, le diamètre moyen du pore de la membrane filtrante ne devra pas être inférieur à 1 µm afin de permettre le passage de la dispersion colloïdale",null,0,0,0,0,"RCP\nDISPO\nAMB1\nAMB2\nAMB3","","RCP","DISPO","AMB1","AMB2","AMB3",null,"Prescription Hospitalière\nRétrocédable "]
["Amphotericine B liposomale \nAMBISOME","Hôpital : rétrocession \nPH ","EPPI\n50 mg dans 12mL\nAgiter vigoureusement le flacon pendant au moins 30 secondes  jusqu’à dispersion complète","3 mg/kg 1 fois par jour\nLa dose peut éventuellement être augmentée en fonction de la situation clinique du patient.","IV","Glucose 5%\nINCOMPATIBLE NaCl\nConcentration comprise entre 0,20 mg/mL à 2 mg/mL d'amphotéricine\nUtiliser le filtre de 5 microns fourni pour injecter la suspension d'Ambisome reconstituée dans la poche de G5%","Gravité 30-60 min (prolonger la durée si perfusion mal tolérée)","Pompe (si perfusion de 2 à 4 heures en cas de posologie supérieure à 3mg/kg/j)","instabilité en diffuseur","Ce médicament ne doit pas être administré par une ligne intraveineuse ayant contenu du chlorure de sodium à 0,9 % sauf si cette ligne a d'abord été rincée avec une solution injectable de glucose\nUne membrane filtrante sur le trajet du cathéter peut être utilisée lors de la perfusion intraveineuse de ce médicament. Cependant, le diamètre moyen des pores du filtre ne devra pas être inférieur à 1,0 micron.\nAbsence de données de stabilité en diffuseur",null,0,0,0,0,"RCP\nDISPO\nStabilis\nAMB1","","RCP","DISPO","AMB1","Stabilis",null,null,"Prescription Hospitalière\nRétrocédable "]
["Amphotericine B lipidique \nABELCET","Hôpital : rétrocession \nPH ","Suspension prête à l'emploi","Dose-test initiale : 1 mg puis 5 mg/kg 1 fois par jour\nLa dose peut éventuellement être augmentée en fonction de la situation clinique du patient.","IV","G5% (250 mL minimum)\nINCOMPATIBLE NaCl\nUtiliser l'aiguille munie d'un filtre de 5 microns fournie pour injecter chaque flacon d'Abelcet dans la poche de G5%\nconcentration de 0,2mg/mL","Dose test : IV lente (15 minutes)\nPompe : 2,5 mg/kg/heure",null,"instabilité en diffuseur","Absence de données de stabilité en diffuseur\nUn filtre sur la ligne de perfusion peut être utilisé pour perfuser ce médicament. Le diamètre des pores ne devra pas être inférieur à 5,0 microns",null,null,null,null,null,"RCP\nDISPO","","RCP","DISPO",null,null,null,null,"Spécialité supprimée depuis fin 2019. A enlever "]
["Aztréonam","Ville","EPPI\n1g dans 3 mL si perfusion\n1g dans 10 mL si IVD","Posologie standard : \nAdministration discontinue\n1g toutes les 8h en perfusion de 30 min\n\nAdministration continue\n2g par jour après dose de charge de 2g en perfusion de 30 min\n                                                                                     \nForte posologie :\nAdministration discontinue\n2g toutes les 6h en perfusion de 30 min\n\nAdministration continue :\n ≥ 6g/j après une dose de charge de 2g en perfusion de 30 min","IV","Si gravité : NaCl 0,9% 100mL\nDiffuseur NaCl 0,9% \nCmax 50mg/mL","Perfusion continue :\nDiffuseur sur 24h (respecter Cmax)\nAdministration discontinue : \nGravité 30 min",null,"non","Ne doit pas être mélangé avec d'autres médicaments ou antibiotiques\n","Voies IM et IVD lente ","x",0,"x",0,"RCP\nDISPO\nPOSO\nSTAB\n","","RCP","DISPO","POSO","STAB",null,null,"Prescription Hospitalière\nDisponible en ville"]
["Caspofungine","Hôpital : rétrocession\nPH","EPPI \n50mg dans 10,5mL\n70mg dans 10,5mL","J1 : 70 mg 1/j\nA partir de J2 :  50mg 1/j (sauf si poids >80kg : 70mg 1/j)","IV","50mg : NaCl 0.9% 100 mL\n70mg : NaCl 0.9% 250 mL\n(Ne pas utiliser  des solutions contenant du glucose)\nCmax 0,5 mg/mL","Gravité 60 min","En cas de mobilité du patient :\n50mg : Diffuseur vol mini 100 mL 60 min\n70mg : Diffuseur vol mini 250 mL 60 min","non","Solution concentrée reconstituée : peut être conservé jusqu’à 24 heures à une température ne dépassant pas 25°C.\nNe doit pas être mélangé avec d'autres médicaments.\nA partir de J2 :  70mg 1/j si association avec un inducteur enzymatique",null,0,0,0,0,"RCP\nDISPO\nStabilis","","RCP","DISPO","Stabilis",null,null,null,"Prescription Hospitalière\nRétrocédable "]
["Céfépime hors infection à Pseudomonas spp","Ville \nPH","EPPI\n1g dans 10 mL\n2g dans 10 mL\n","Posologie standard:\n1g toutes les 8h en perfusion de 30 min\n                                                                                     \nForte posologie :\nAdministration discontinue :\n2g toutes les 8h en perfusion de 30 min\n\nAdministration continue :\n≥ 4g/j après dose de charge de 2g en perfusion de 30 min","IV","Si gravité NaCl 0,9% 100 mL\nPour la pompe : NaCl 0,9% (Cmax 125 mg/mL)","Perfusion continue :\nPompe : sur 24h (respecter la Cmax)\nAdministration discontinue : \nGravité 30 min",null,"instabilité en diffuseur","Mode d'administration par diffuseur non recommandé compte-tenu de l'absence de données de stabilité physico-chimiques à 37°C\nPeut prendre une coloration jaune ambrée sans perte d'activité. Ne doit pas être mélangé avec d'autres médicaments\n","Possibilité d'administration du 1g en IM profonde\nVoie IVD lente","x",0,"x",0,"RCP\nDISPO\nPOSO\nSTAB","","RCP","DISPO","POSO","STAB",null,null,"Prescription Hospitalière\nDisponible en ville"]
["Céfépime infection à Pseudomonas spp","Ville \nPH","EPPI\n1g dans 10 mL\n2g dans 10 mL\n","Forte posologie :\nAdministration discontinue :\n2g toutes les 6h en perfusion de 30 min\n\nAdministration continue :\n≥ 6g/j après dose de charge de 2g en perfusion de 30 min","IV","Si gravité NaCl 0,9% 100 mL\nPour la pompe : NaCl 0,9% (Cmax 125 mg/mL)","Perfusion continue :\nPompe : sur 24h (respecter la Cmax)\nAdministration discontinue : \nGravité 30 min",null,"instabilité en diffuseur","Mode d'administration par diffuseur non recommandé compte-tenu de l'absence de données de stabilité physico-chimiques à 37°C\nPeut prendre une coloration jaune ambrée sans perte d'activité. Ne doit pas être mélangé avec d'autres médicaments\n","Possibilité d'administration du 1g en IM profonde\nVoie IVD lente","x",0,"x",0,"RCP\nDISPO\nPOSO\nSTAB","","RCP","DISPO","POSO","STAB",null,null,"Prescription Hospitalière\nDisponible en ville"]
["Céfoxitine","Hôpital : rétrocession\nPH\n","EPPI\n1g dans 10 mL\n2g dans 10 mL\n","Administration continue : \n≥ 8 g/jour après dose de charge de 2 g sur 30 min","IV","G5%\nCmax 125 mg/mL\n","Perfusion continue : \nPompe sur 12h (respecter Cmax)\n",null,"instabilité en diffuseur","Mode d'administration par diffuseur non recommandé compte-tenu de l'absence de données de stabilité physico-chimiques à 37°C\n","Voie IVD lente","x",0,0,0,"RCP\nDISPO\nPOSO\nSTAB","","RCP","DISPO","POSO","STAB",null,null,"Prescription Hospitalière\nRétrocédable "]
["Ceftazidime","Ville \nPH","EPPI\n1g dans 10mL\n2g dans 10mL\n(Facteur de déplacement \nDégagement gazeux)","Posologie standard :\nAdministration discontinue : \n1g toutes les 8h en perfusion de 30 min\n\nAdministration continue : \n2g par jour après dose de charge de 2g en perfusion de 30 min\n                                                                                     \nForte posologie :\nAdministration discontinue : \n2g toutes les 8h en perfusion de 30 min\n\nAdministration continue :\n≥ 4g/j après dose de charge de 2g en perfusion de 30 min","IV","Gravité : NaCl 0,9% 100 mL (Cmax 40 mg/mL)\nDiffuseur : NaCl 0,9%, volume à adapter (Cmax 25 mg/mL)","Perfusion continue :\nDiffuseur sur 12h (respecter Cmax)\nAdministration discontinue :\nGravité 30 min",null,"non",null,"Voie IVD lente\nL'administration intramusculaire doit uniquement être envisagée lorsque la voie intraveineuse n'est pas possible ou est moins appropriée pour le patient.","x",0,"x L'administration intramusculaire doit uniquement être envisagée lorsque la voie intraveineuse n'est pas possible ou est moins appropriée pour le patient.",0,"RCP\nDISPO\nPOSO\nCAZ1\nCAZ2\nSTAB","","RCP","DISPO","POSO","CAZ1","CAZ2","STAB","Prescription Hospitalière\nDisponible en ville"]
["Ceftriaxone","Ville et hôpital : rétrocession","EPPI\n1g  dans 10 mL\n2g dans 20 mL ","Posologie standard : \n1 à 2g toutes les 24h\n                                                                                     \nForte posologie :\n2g toutes les 12h","IV","Si perfusion par gravité : NaCl 0,9% 100 mL\nCmax 50mg/mL","Gravité 30 minutes",null,"non","\n\nIl est recommandé de perfuser la Ceftriaxone à distance et sur une voie séparée du calcium","Voies IM et IVD lente possibles en l'absence d'autres alternatives\nVoie SC non conforme (ANSM 23/10/2019)\nNéanmoins dans certaines situations, le clinicien peut juger indispensable l’administration de la ceftriaxone par voie sous-cutanée au regard du rapport bénéfice/risque pour son patient et sous réserve d’en informer ce dernier ou sa famille. (ANSM Novembre 2019)","x",0,"x L'administration intramusculaire doit être envisagée lorsque la voie intraveineuse n'est pas possible ou est moins appropriée pour le patient. Pour des doses supérieures à 2 g, la voie intraveineuse doit être utilisée.",0,"RCP\nDISPO\nPOSO\nCTX1\nANSM (courrier 23/10/2019)","","RCP","DISPO","POSO","CTX1",null,null,"Disponible en ville"]
["Ertapénème","Hôpital : rétrocession\nPH","EPPI\n1g  dans 10 mL","1g toutes les 24h en perfusion de 30 min\n(Pour les souches dont la CMI est égale à 0,5 mg/L, une posologie journalière de 1 g × 2 peut se discuter)","IV","NaCl 0.9% 100 mL\nCmax 20mg/mL\n","Gravité 30 min",null,"non","\n",null,0,0,0,0,"RCP\nDISPO\nPOSO\nETP1","","RCP","DISPO","POSO","ETP1",null,null,"Prescription Hospitalière\nRétrocédable "]
["Gentamicine","Ville","Ampoule prête à l'emploi","6 à 7 mg/kg/jour en perfusion de 30 min en dose unique journalière","IV","NaCl 0.9%\nCmax 10 mg/mL","Gravité 30 min",null,"non","Ne doit pas être mélangé avec d'autres médicaments.\nSurveillance : Dosage pic plasmatique si besoin et concentrations résiduelles si durée > 5 jours ou IR ","Voie IM ",0,0,"x",0,"RCP\nDISPO\nPOSO\nDiamantis et al\nAN1","","RCP","DISPO","POSO","Diamantis et al","AN1",null,"Disponible en ville"]
["Imipénème + cilastine","Ville \nPH","NaCl 0,9%\nModalités : Ajouter environ 10 mL de la solution pour perfusion appropriée dans le flacon. Répéter la procédure avec 10 mL supplémentaires et transférer dans la solution pour perfusion. Agiter.","Posologie standard :\n0,5g toutes les 6h\n1g toutes les 8h\n                                                                                     \nForte posologie :\n1g toutes les 6h","IV","NaCl 0,9%  100 mL\nCmax 5 mg/mL","Dose ≤ 500mg : Gravité 20-30 min \nDose > 500mg : Gravité 40-60 min",null,"non","La solution reconstituée ne doit pas être utilisée directement pour la perfusion\nLa perfusion continue n'est pas recommandée (problème de stabilité)\nLa vitesse de perfusion peut être ralentie en cas de nausées pendant la perfusion ou de posologies élevées",null,0,0,0,0,"RCP\nDISPO\nPOSO","","RCP","DISPO","POSO",null,null,null,"Prescription Hospitalière\nDisponible en ville"]
["Méropénème","Ville \nPH","EPPI\nVolume de solvant selon la dose : \n- 500 mg : 10 mL\n- 1 g : 20 mL\n- 2 g : 40 mL","Posologie standard :\n1g toutes les 8h en perfusion de 30 min\n                                                                                     \nForte posologie :\n2g toutes les 8h en perfusion de 3h à 8h","IV","Si gravité NaCl 0,9% :\n- 1 g : 100 mL\n- 2 g : 250 mL\nCmax 20 mg/mL\n\nPour les PSE : NaCl 0,9% (Cmax 41,7 mg/mL soit 2 g dans 48 mL)","1 gx3/j : Gravité 30 min\n2gx3/j : PSE sur 3h à 8h",null,"objectifs d'efficacité PK/PD","La posologie de 2 g toutes les 8 h en perfusions de 30 min ne permet pas d’atteindre les objectifs d’efficacité PK/PD pour les souches catégorisées « SFP »\n","Voie IVD lente","x",0,0,0,"RCP\nDISPO\nStabilis\nPOSO\nETP1","","RCP","DISPO","Stabilis","POSO","ETP1",null,"Prescription Hospitalière\nDisponible en ville"]
["Oxacilline","Ville","EPPI :\n- 1 g : 5 mL","Administration discontinue :\n100 à 200 mg/kg/jour toutes les 4h en perfusion de 30 à 60 min\n\nAdministration continue : \n100 à 200 mg/kg/jour après dose de charge de 2 g sur 60 min","IV","Si perfusion continue ou administration discontinue : NaCl 0,9% \nCmax 50 mg/mL","Perfusion continue :\nDiffuseur sur 8h (respecter la Cmax)","Administration discontinue :\nGravité 30 à 60 min","non",null,"Voie IVD lente",0,0,0,0,"RCP\nDISPO\nPOSO\nOXA","","RCP","DISPO","POSO","OXA",null,null,"Disponible en ville"]
["Pipéracilline-tazobactam","Ville \nPH","EPPI\n2g: 10 mL\n4g: 20 mL","Posologie standard :\nAdministration discontinue : \n4g/0,5g toutes les 6h en perfusion de 30 min\n\nAdministration continue : \n8 g/jour après dose de charge de [4 g pipéracilline + 0,5 g tazobactam] en perfusion de 30 min\n                                                                                     \nForte posologie :\nAdministration continue :\n≥ 12 g/jour après dose de charge de [4 g pipéracilline + 0,5 g tazobactam] en perfusion de 30 min","IV","Si gravité NaCl 0,9% 100 mL\nSi diffuseur : G5% (Cmax 66,7 mg/mL)\n","En cas d'administration discontinue :\nGravité 30 min\nEn cas de perfusion continue :\nDiffuseur sur 24h (respecter la Cmax)",null,"non",null,null,"x",0,"x",0,"DISPO\nPOSO\nSTAB\nTZP2 ","RCP à ajouter ",null,"DISPO","POSO","STAB","TZP2",null,"Prescription Hospitalière\nDisponible en ville"]
["Teicoplanine ","Hôpital : \nrétrocession \nPH \n","EPPI\n100mg dans 1,7 mL\n200 et 400mg dans 3,14 mL\n","Dose de charge : 12mg/kg toutes les 12h en 3 à 5 injections\nDose d'entretien : 12mg/kg/j, toutes les 24h\n","IV","Si gravité : NaCl 0,9% 100mL\nCmax : 40 mg/mL","Gravité 30 min",null,"non","Stable 24h à 25°C\nAgiter doucement pour éviter la formation de mousse.\nSi apparition de mousse lors de la reconstitution, laisser reposer jusqu'à disparition\nSurveillance : dosage des taux résiduels, plaquettes en cas de thrombopénie préexistante ou de traitement prolongé","Voies IM et IVD lente ","x",0,"x",0,"RCP\nDISPO\nPOSO\nHUG\nDiamantis et al","","RCP","DISPO","POSO","HUG","Diamantis et al",null,"Prescription Hospitalière\nRétrocédable "]
["Témocilline","Hôpital : rétrocession\nPH\n","EPPI\n1g dans 10 mL\n2 g dans 20 mL\n","Administration discontinue :\n2g toutes les 8h en perfusion de 30 min\n\nAdministration continue : \n≥ 6 g/jour après dose de charge de 2 g en perfusion de 30 min","IV","Si gravité : NaCl 0,9% 100 mL\nSi perfusion continue : NaCl 0,9% (Cmax 25 mg/mL)\n","Perfusion continue : \nDiffuseur sur 24 h (respecter Cmax) \nAdministration discontinue : \nGravité 30 min",null,"non","Le produit doit toujours être utilisé immédiatement après la reconstitution et la dilution.\nLa posologie de 2 g toutes les 12 h en perfusions de 30 min a été utilisée avec succès dans des études rétrospectives portant sur des infections urinaires.","Voies IM et IVD lente ","x",0,"x",0,"RCP \nDISPO\nPOSO\nSTAB","","RCP","DISPO","POSO","STAB",null,null,"Prescription Hospitalière\nRétrocédable "]
["Tobramycine","Ville ","ampoule prête à l'emploi","6 à 7 mg/kg/j  en perfusion de 30 min en dose unique journalière","IV","NaCl 0.9% 100mL","Gravité 30 min",null,"non","Ne doit pas être mélangé avec d'autres médicaments\nutilisation immédiate après reconstitution\nSurveillance : Dosage pic plasmatique si besoin et concentrations résiduelles si durée > 5 jours ou IR ",null,"x ?",0,"x",0,"RCP\nDISPO\nPOSO\nAN1","","RCP","DISPO","POSO","AN1",null,null,"Disponible en ville"]
["Vancomycine","Hôpital : \nrétrocession \nPH \n","EPPI\n500 mg dans 10 mL \n1g dans 20 mL\n\n","Administration discontinue : \nDose de charge : 20 à 30 mg/kg en 1h à 2h\nDose d'entretien : 20 à 40 mg/kg/j en perfusion de 1h, toutes les 12h à 6h\n\nAdministration continue \nDose de charge : 20 à 30 mg/kg en 1h à 2h\nDose d'entretien : 20 à 40mg/kg/j","IV","NE PAS ADMINISTRER SANS DILUTION\nNaCl 0,9% \nVVP avec gravité : Cmax 5 mg/mL jusqu'à 10 mg/mL si restriction hydrique\nVVC avec diffuseur : Cmax 37,5 mg/mL pour une stabilité jusqu'à 37°C sur 24h","Perfusion continue sur voie veineuse centrale :\nDiffuseur sur 24h (respecter Cmax)","Administration discontinue sur voie veineuse périphérique :\nGravité 60 min\n","non","Pas de perfusion continue sur voie veineuse périphérique à domicile\nNe pas mélanger avec d'autres médicaments. \nNe pas administrer sans dilution. \nSurveillance : dosage des taux résiduels, dosage de la créatinine sérique, NFS","Pas d'IVD, pas d'IM",0,0,0,0,"RCP\nDISPO\nPOSO\nHUG\nSTAB","","RCP","DISPO","POSO","HUG","STAB",null,"Prescription Hospitalière\nRétrocédable "]
["IMMUNOGLOBULINES POLYVALENTES IV",null,null,null,null,null,null,null,null,null,null,null,null,null,null,null,""]
["Immunoglobulines Polyvalentes IV \n","Hôpital : rétrocession \nPH","EPPI ou prêtes à l'emploi\n--> Consulter les fiches dédiées "," --> Consulter les fiches dédiées (Gammagard, Tegeline, Privigen, Octagam, …)","IV","Si besoin diluer dans solution de Glucose 5% si concentration souhaitée à 50 mg/mL (5 %)","Pompe",null,"nécessité précision du débit ≥ 95% sécurisée","Lors de la première injection le débit doit être lent. Il pourra être augmenté par la suite selon la tolérance du patient et les RCP des différentes immunoglobulines\n --> Consulter les fiches dédiées \nLa solution doit être controlée et sans particule\nLe produit doit être amené à température ambiante (25°C) avant l'utilisation\n",null,null,null,null,null,"RCP\nIgIV1 \nIgIV2\nIgIV3\n\n","","RCP","IgIV1","IgIV2","IgIV3",null,null,"Prescription Hospitalière\nRétrocédable "]
["IMMUNOGLOBULINES POLYVALENTES SC",null,null,null,null,null,null,null,null,null,null,null,null,null,null,null,""]
["Immunoglobulines Polyvalentes SC\n","Hôpital : rétrocession \nPH "," Prêtes à l'emploi"," --> Consulter les fiches dédiées (Gammanorm, Hizentra, …)","SC\n",null,"Pompe ou PSE",null,"nécessité précision du débit ≥ 95% sécurisée","Lors de la première injection le débit doit être lent. Il pourra être augmenté par la suite selon la tolérance du patient et les RCP des différentes immunoglobulines\n --> Consulter les fiches dédiées \nLe médicament doit être amené à température ambiante ou du corps avant utilisation.\n","Pour GAMMANORM : IM possible",null,null,null,null,"RCP\nIgSC1 \nIgSC2","","RCP","IgSC1","IgSC2",null,null,null,"Prescription Hospitalière\nRétrocédable "]
["CLASSE ATC SYSTÈME NERVEUX",null,null,null,null,null,null,null,null,null,null,{"$error":"#N/A"},{"$error":"#N/A"},{"$error":"#N/A"},{"$error":"#N/A"},null,""]
["Apomorphine","Ville","Ampoule prête à l'emploi","Perfusion initiale à 1mg/h puis\nPerfusion d'entretien selon la réponse individuelle de 1 mg/h à 7 mg/h (4mg/h avec DOPACEPTIN) \nAugmentation par paliers de 0,5 mg/heure maxi avec des intervalles d'au moins 4 heures\nRecommandation : ne pas dépasser une dose totale d'apomorphine de 100 mg/j","Perfusion continue SC ± bolus intermittents","Pas de modalités de dilution","Pompe ou PSE",null,"nécessité précision du débit ≥ 95% sécurisée","Perfusion continue durant les périodes d'éveil,\nRespecter une période nocturne sans traitement d'au moins 4 heures\n24h/24h déconseillé (sauf cas particuliers)\n\nChanger de site de perfusion toutes les 12 heures\nNe pas utiliser la voie IV",null,0,0,0,0,"RCP","","RCP",null,null,null,null,null,"Disponible en ville"]
["Midazolam","Ville (assimilé stupéfiants avec durée de fractionnement limitéé à 7 jours sauf mention \"délivrance en une seule fois\")","Ampoule prête à l'emploi","Sédation vigile\nSédation en soins palliatifs chez l'adulte (proportionnée ou profonde et continue)","IV",null,"Administration en bolus :\nIVD lente\nAdministration en continu : \nPSE",null,"nécessité précision du débit ≥ 95% sécurisée",null,"Administrations IM, SC et rectale possibles","x",0,0,0,"RCP\nMI1  ","","RCP","MI1",null,null,null,null,"\nAssimilé stupéfiant : ordonnance sécurisée, de 28 jours maximum avec délivrance fractionnée de 7j sauf mention expresse du prescripteur « délivrance en une seule fois »\nDisponible en ville dans les 2 indications de sédation. "]
["Morphine","Ville","Utiliser des ampoules de même concentration.\nPrêt à l'emploi, concentrations disponibles : 1 ; 10 ; 20 ; 100 mg/mL\n","Selon protocole (bolus + perfusion continue)\nBolus IV  : 1 à 3 mg espacés de 4 à 6 heures.\nRelais en perfusion SC continue (0,5 mg/kg/jour) ou IV continue (0,3 mg/kg/jour)\nPas de dose maxi tant que les effets secondaires sont contrôlés","Perfusion continue (PCA) IV ou SC","Ne pas diluer si possible, sinon NaCl 0,9%\nConcentration qui doit être compatible avec le débit minimal ou la dose minimale du bolus demandé","Pompe PCA \n",null,"nécessité précision du débit ≥ 95% sécurisée","Le raccordement de la tubulure PCA doit être placé au plus près possible du point d'injection. \nToute connexion supplémentaire doit être montée en amont d'une valve anti-retour et placée en Y de la ligne de perfusion PCA\nLe débit continu en mg/j (débit de perfusion) doit être arrondi, XY mg/24h en nombre entier multiple de 12 en fonction de la durée de la prescription (pour éviter les calculs)\nL’utilisation d’un pousse seringue électrique (PSE) à la place d’une pompe PCA n'est pas recommandée à domicile (système non sécurisé)",null,"x","x",0,0,"MO1\nMO2\nMO3 \nMO4","RCP à ajouter ","MO1","MO2","MO3","MO4",null,null,"Disponible en ville\nStupéfiant "]
["Néfopam","Ville","Ampoule prête à l'emploi","20mg toutes les 4h (max 120mg/j)","IV","Si perfusion : Nacl 0,9% 100 mL","Gravité 15 à 30 min","Diffuseur","non","Absence de donnée de stabilité publiée mais une pratique clinique en faveur du diffuseur. Etudes de stabilité en cours","Autres voies : IM profonde toutes les 6h\nVoie sublinguale en pratique (hors AMM)",0,0,"x",0,"RCP  \nTheriaque","Ajouter Stabilis ?","RCP","Theriaque",null,null,null,null,"Prescription non renouvelable\nDisponible en ville"]
["Oxycodone","Hôpital : rétrocession dérogatoire pour douleurs chroniques et soins palliatifs","Utiliser des ampoules de même concentration.\n\nPrêt à l'emploi, concentrations disponibles : 1 ; 10 ; 50 mg/mL","Selon protocole (bolus + perfusion continue)\nBolus :\n- IV de 1 à 10mg\n- SC 5mg\nPerfusion, dosage initial :\nIV et SC : 0,125mg/kg/jour\nDoses patient dépendant","IV\nSC","Ne pas diluer si possible, sinon NaCl 0,9%\nConcentration qui doit être compatible avec le débit minimal ou la dose minimale du bolus demandé","Pompe PCA",null,"nécessité précision du débit ≥ 95% sécurisée","Le raccordement de la tubulure PCA doit être placé au plus près possible du point d'injection. \nToute connexion supplémentaire doit être montée en amont d'une valve anti-retour et placée en Y de la ligne de perfusion PCA\nPoches prêtes à l'emploi 100 mL avec 2 concentrations différentes (1mg/mL et 10mg/mL)\nL’utilisation d’un pousse seringue électrique (PSE) à la place d’une pompe PCA n'est pas recommandée à domicile (système non sécurisé)\n\nConcentration préférentielle pour perfusion :\n1mg/ml pour IV,\n10mg/mL pour SC",null,"x","x",0,0,"RCP\nOXY1\nMO4","","RCP","OXY1","MO4",null,null,null,"Rétrocedable uniquement dans le cadre des douleurs chroniques et soins palliatifs "]
["Ropivacaïne","Hôpital : rétrocession \nPH","Poche prête à l'emploi concentration 2mg/mL","10-20 mg/h en continu","Périnerveux","Pas de dilution","Pompe PCA ou Diffuseur",null,"nécessité précision du débit ≥ 95% sécurisée","Bloc périphérique nerveux (analgésie  post-opératoire)\nL’analgésie post-opératoire par cathéter péri-nerveux en ambulatoire nécessite une surveillance à domicile pendant la période du cathéterisme périnerveux (48 à 72 heures) : surveillance infirmière quotidienne et présence d’un proche au domicile en fin de journée ou à défaut surveillance biquotidienne de l’infirmier(e).                                           ","Dans le cadre des soins palliatifs à domicile (hors AMM) la Ropivacaïne peut être injectée par voie périmédullaire.",0,0,0,"Périneurale / péridurale","ROP1\nROP2","RCP à ajouter ","ROP1","ROP2",null,null,null,null,"Rétrocedable"]
["CLASSE ATC ANTINEOPLASIQUE ET IMMUNOMODULATEURS",null,null,null,null,null,null,null,null,null,null,null,null,null,null,null,""]
["5 FU","Hôpital : rétrocession","La préparation doit être réalisée en PUI, se référer aux protocoles locaux","Selon protocole de l'établissement autorisé en cancérologie","IV","La préparation doit être réalisée en PUI, se référer aux protocoles locaux","Diffuseur\r",null,null,"Ne doit pas etre mélangé avec d'autres médicaments. Incompatibilité avec le levofolinate de calcium et les solutions de morphine\n",null,0,0,0,0,"RCP\nStabilis\r\nBPPH\r\n5FU1\n5FU2","","RCP","Stabilis","BPPH","5FU1","5FU2",null,"Prescription Hospitalière \nRétrocedable"]
["CLASSE ATC SANG ET ORGANE HEMATOPOETIQUE",null,null,null,null,null,null,null,null,null,null,null,null,null,null,null,""]
["Chlorure de sodium","Ville","Prêt à l'emploi","La posologie usuelle doit être adaptée aux besoins du patient en fonction de l'état clinique, du poids et des résultats des examens ioniques sanguins et urinaires","IV\nSC (à privilégier en gériatrie, en soins palliatifs et pour les patients au capital veineux altéré)",null,"IV : Gravité\nSC : Gravité\n1500mL à 2000mL /24h/site injection\nou\n1000mL/8h la nuit\nou\n500mL/2h",null,"non","La posologie, le débit et la durée d’administration doivent être déterminés en fonction de plusieurs facteurs comprenant l'âge, le poids, l'état clinique, les pathologies cardiaques, le traitement concomitant et en particulier l'état d'hydratation du patient, des besoins en ions sodium et chlorure, la réponse clinique et biologique au traitement","Voie IM ",0,"x","x",0,"RCP\nNaCl1\nNaCl2 ","","RCP","NaCl1","NaCl2",null,null,null,"Disponible en ville"]
["Héparine sodique","Ville\n","Ampoule et flacon prêts à emploi","En traitement curatif en prévention des accidents thromboemboliques en cas de cardiopathie emboligène:\n- Hors coagulopathie :\n1/ bolus : 50UI/kg\n2/ dose initiale 20UI/kg/heure puis à adapter\n- Coagulopathie :dose inférieure (risque hémorragique)\n\n","IV","En fonction des protocoles\n\nLa dose journalière doit être répartie dans au moins 2 seringues par jour","Administration en bolus :\nIVD lente\nPosologie initiale et entretien : \nPSE",null,"non","Ne pas injecter par voie IM\nNe doit pas être mélangé avec d'autres médicaments\nConservation à température ambiante, \nAprès ouverture le produit doit être utilisé immédiatement \nSurveillance biologique quotidienne ( TCA ou activité anti-Xa), plaquettes\nRelais par anticoagulants oraux chaque fois que cela est possible",null,"x bolus",0,0,0,"RCP\n","","RCP",null,null,null,null,null,"Disponible en ville"]
["Hydrate de carbone (soluté glucosé) polyionique prêts à l'emploi","Ville","Glucose 2,5% ou 5 % AVEC CHLORURE DE SODIUM\n","La posologie usuelle doit être adaptée aux besoins du patient en fonction de l'état clinique, du poids et des résultats des examens ioniques sanguins et urinaires\n","IV\nSC (à privilégier en gériatrie, en soins palliatifs et pour les patients au capital veineux altéré)",null,"IV : Gravité\nSC : Gravité\n1500mL à 2000mL /24h/site injection\nou\n1000mL/8h la nuit\nou\n500mL/2h",null,"non","L'équilibre hydrique, la glycémie, la natrémie et d'autres électrolytes pourront faire l'objet d'une surveillance avant ou pendant l'administration",null,0,0,0,0,"NaCl1\nNaCl2","RCP à ajouter ","NaCl1","NaCl2",null,null,null,null,"Disponible en ville"]
["Hydrate de carbone (soluté glucosé) polyionique prêts à l'emploi","Ville","Utiliser des solutés isotoniques polyioniques prêts à l'emploi\nBIONOLYTE G5\nPOLYIONIQUE 1A G5 BXT VFO","La posologie usuelle doit être adaptée aux besoins du patient en fonction de l'état clinique, du poids et des résultats des examens ioniques sanguins et urinaires\n","IV",null,"IV : Gravité\n1500mL à 2000mL /24h/site injection\nou\n1000mL/8h la nuit\nou\n500mL/2h",null,"non","L'équilibre hydrique, la glycémie, la natrémie et d'autres électrolytes pourront faire l'objet d'une surveillance avant ou pendant l'administration\nL'administration de potassium en SC est à éviter à cause du risque de nécrose cutanée",null,0,0,0,0,"NaCl1\nNaCl2","RCP à ajouter ","NaCl1","NaCl2",null,null,null,null,"Disponible en ville"]
["CLASSE ATC MUSCLE ET SQUELETTE",null,null,null,null,null,null,null,null,null,null,null,null,null,null,null,""]
["Acide Zolédronique","Ville","EPPI 5 mL ou prêt à l'emploi (en fonction des présentations et des génériques) ","En fonction de l'indication et de la présentation ","IV","4 ou 5 mg / 100 mL : pas de dilution\n4 ou 5 mg / 5 mL : 100 mL NaCl 0,9%\n\nDilution pour les insuffisants rénaux (cf commentaires)","Gravité 15-30 min",null,"non","Dose si IR: 3,5, 3,3 mg ou 3 mg.\nDilution  de l'acide zolédronique 4 mg/100 mL :\n - 3,5 mg : Retirer 12 mL et remplacer par 12 mL de NaCl 0,9%\n - 3,3 mg : Retirer 18 mL et remplacer par 18 mL de NaCl 0,9%\n - 3 mg : Retirer 25 mL et remplacer par 25 mL de NaCl 0,9%\n\nNe doit pas être mélangé avec des solutions contenant du calcium",null,0,0,0,0,"RCP","","RCP",null,null,null,null,null,"Disponible en ville"]
["CLASSE ATC HORMONES SYSTEMIQUES",null,null,null,null,null,null,null,null,null,null,null,null,null,null,null,""]
["Bétaméthasone\n4mg/1mL","Ville ","Prêt à l'emploi","1 à 5 ampoules/administration à adapter en fonction de l'indication (la dose peut éventuellement être augmentée en fonction de la situation clinique du patient)","IV","NaCl 0,9% 100 mL","Gravité 15-30 min",null,"non",null,"Voie IVD \nVoie IM","X",0,"x",0,"RCP\nBE1\n\n","","RCP","BE1",null,null,null,null,"Disponible en ville"]
["Méthylprednisolone","Ville","EPPI\n20mg /40mg /120mg dans 2 mL\n1g dans 15,6 mL","Selon indication","IV","si perfusion dans NaCl 0.9 %","Gravité 20-30 min",null,"non","incompatibilités: allopurinol sodium, chlorhydrate de doxapram, tigécycline, chlorhydrate de diltiazem, gluconate de calcium, bromure de rocuronium, bésilate de cisatracurium, glycopyrrolate, propofol","IM profonde possible pour dosage à 20mg\nIVD lente minimum 20-30 min","X",0,0,0,"RCP \nStabilis\n","","RCP","Stabilis",null,null,null,null,"Disponible en ville"]

{"sheet":"Liste","index":9,"n_rows":41,"n_cols":15,"rows_kept":41,"cut":false,"hidden":true,"merged":[]}
["DCI unique","Mode Administration","Catégorie d'établissement",null,null,null,null,null,null,"Support de prescription",null,null,null,"Conformité_BDD","classes ATC"]
[{"$f":"IFERROR(INDEX(Référentiel_pour_Sphinx!$A:$A,MIN(IF(Référentiel_pour_Sphinx!$A$2:$A$300<>\"\",IF(COUNTIF(A$1:A1,Référentiel_pour_Sphinx!$A$2:$A$300)=0,ROW(Référentiel_pour_Sphinx!$A$2:$A$300),9^9)))),\"\")","v":"5 FU"},"IVD lente","autre","IVD lente","Gravité","Diffuseur","Système actif électrique",null,null,"Formulaire de perfusion à domicile (Assurance Maladie)",null,null,null,"Conformité du mode d'administration","Anti-infectieux (usage systémique)"]
[{"$f":"IFERROR(INDEX(Référentiel_pour_Sphinx!$A:$A,MIN(IF(Référentiel_pour_Sphinx!$A$2:$A$300<>\"\",IF(COUNTIF(A$1:A2,Référentiel_pour_Sphinx!$A$2:$A$300)=0,ROW(Référentiel_pour_Sphinx!$A$2:$A$300),9^9)))),\"\")","v":"ACIDE ZOLEDRONIQUE"},"Gravité","psy","Conformité",null,null,null,null,null,"Formulaire protocolisé de l'établissement",null,null,null,"Modalité alternative d'administration","Antinéoplasiques et agents immunomodulants"]
[{"$f":"IFERROR(INDEX(Référentiel_pour_Sphinx!$A:$A,MIN(IF(Référentiel_pour_Sphinx!$A$2:$A$300<>\"\",IF(COUNTIF(A$1:A3,Référentiel_pour_Sphinx!$A$2:$A$300)=0,ROW(Référentiel_pour_Sphinx!$A$2:$A$300),9^9)))),\"\")","v":"AMIKACINE"},"Diffuseur","HAD","Conformité du mode d'administration",null,null,null,null,null,"Ordonnance libre",null,null,null,"Non Conformité du mode d'administration","Antiparasitaires, insecticides et répulsifs"]
[{"$f":"IFERROR(INDEX(Référentiel_pour_Sphinx!$A:$A,MIN(IF(Référentiel_pour_Sphinx!$A$2:$A$300<>\"\",IF(COUNTIF(A$1:A4,Référentiel_pour_Sphinx!$A$2:$A$300)=0,ROW(Référentiel_pour_Sphinx!$A$2:$A$300),9^9)))),\"\")","v":"AMOXICILLINE"},"Système Actif Electrique","CH","Modalité alternative d'administration",null,null,null,null,null,"Ordonnance prérenseignée du prestataire",null,null,null,"Non Conformité : Prescription Incomplète","Dermatologie"]
[{"$f":"IFERROR(INDEX(Référentiel_pour_Sphinx!$A:$A,MIN(IF(Référentiel_pour_Sphinx!$A$2:$A$300<>\"\",IF(COUNTIF(A$1:A5,Référentiel_pour_Sphinx!$A$2:$A$300)=0,ROW(Référentiel_pour_Sphinx!$A$2:$A$300),9^9)))),\"\")","v":"AMOXICILLINE ACIDE CLAVULANIQUE"},"Hors liste","hl","Non Conformité du mode d'administration",null,null,null,null,null,"Autre",null,null,null,"Hors guide du ResOMeDIT","Hormones systémiques, à l'exclusion des hormones sexuelles et des insulines"]
[{"$f":"IFERROR(INDEX(Référentiel_pour_Sphinx!$A:$A,MIN(IF(Référentiel_pour_Sphinx!$A$2:$A$300<>\"\",IF(COUNTIF(A$1:A6,Référentiel_pour_Sphinx!$A$2:$A$300)=0,ROW(Référentiel_pour_Sphinx!$A$2:$A$300),9^9)))),\"\")","v":"AMPHOTERICINE B FUNGIZONE"},"Non Renseigné","chr","Non conformité : Prescription incomplète",null,null,null,null,null,null,null,null,null,null,"Organes sensoriels"]
[{"$f":"IFERROR(INDEX(Référentiel_pour_Sphinx!$A:$A,MIN(IF(Référentiel_pour_Sphinx!$A$2:$A$300<>\"\",IF(COUNTIF(A$1:A7,Référentiel_pour_Sphinx!$A$2:$A$300)=0,ROW(Référentiel_pour_Sphinx!$A$2:$A$300),9^9)))),\"\")","v":"AMPHOTERICINE B LIPOSOMALE AMBISOME"},"Sous-cutané","SSR","Situation non intégrée dans le guide ResOMeDIT",null,null,null,null,null,null,null,null,null,null,"Sang et organes hématopoiétiques"]
[{"$f":"IFERROR(INDEX(Référentiel_pour_Sphinx!$A:$A,MIN(IF(Référentiel_pour_Sphinx!$A$2:$A$300<>\"\",IF(COUNTIF(A$1:A8,Référentiel_pour_Sphinx!$A$2:$A$300)=0,ROW(Référentiel_pour_Sphinx!$A$2:$A$300),9^9)))),\"\")","v":"APOMORPHINE"},"Intra-veineux","aut","Saisie Incomplète",null,null,null,null,null,null,null,null,null,null,"Système cardio-vasculaire"]
[{"$f":"IFERROR(INDEX(Référentiel_pour_Sphinx!$A:$A,MIN(IF(Référentiel_pour_Sphinx!$A$2:$A$300<>\"\",IF(COUNTIF(A$1:A9,Référentiel_pour_Sphinx!$A$2:$A$300)=0,ROW(Référentiel_pour_Sphinx!$A$2:$A$300),9^9)))),\"\")","v":"AZTREONAM"},null,"can",null,null,null,null,null,null,null,null,null,null,null,"Système digestif et métabolisme"]
[{"$f":"IFERROR(INDEX(Référentiel_pour_Sphinx!$A:$A,MIN(IF(Référentiel_pour_Sphinx!$A$2:$A$300<>\"\",IF(COUNTIF(A$1:A10,Référentiel_pour_Sphinx!$A$2:$A$300)=0,ROW(Référentiel_pour_Sphinx!$A$2:$A$300),9^9)))),\"\")","v":"BETAMETHASONE"},null,null,null,null,null,null,null,null,null,null,null,null,null,"Système génito-urinaire et hormones sexuelles"]
[{"$f":"IFERROR(INDEX(Référentiel_pour_Sphinx!$A:$A,MIN(IF(Référentiel_pour_Sphinx!$A$2:$A$300<>\"\",IF(COUNTIF(A$1:A11,Référentiel_pour_Sphinx!$A$2:$A$300)=0,ROW(Référentiel_pour_Sphinx!$A$2:$A$300),9^9)))),\"\")","v":"CASPOFUNGINE"},null,null,null,null,null,null,null,null,null,null,null,null,null,"Système musculo-squelettique"]
[{"$f":"IFERROR(INDEX(Référentiel_pour_Sphinx!$A:$A,MIN(IF(Référentiel_pour_Sphinx!$A$2:$A$300<>\"\",IF(COUNTIF(A$1:A12,Référentiel_pour_Sphinx!$A$2:$A$300)=0,ROW(Référentiel_pour_Sphinx!$A$2:$A$300),9^9)))),\"\")","v":"CEFEPIME"},null,null,null,null,null,null,null,null,null,null,null,null,null,"Système nerveux"]
[{"$f":"IFERROR(INDEX(Référentiel_pour_Sphinx!$A:$A,MIN(IF(Référentiel_pour_Sphinx!$A$2:$A$300<>\"\",IF(COUNTIF(A$1:A13,Référentiel_pour_Sphinx!$A$2:$A$300)=0,ROW(Référentiel_pour_Sphinx!$A$2:$A$300),9^9)))),\"\")","v":"CEFOXITINE"},null,null,null,null,null,null,null,null,null,null,null,null,null,"Système respiratoire"]
[{"$f":"IFERROR(INDEX(Référentiel_pour_Sphinx!$A:$A,MIN(IF(Référentiel_pour_Sphinx!$A$2:$A$300<>\"\",IF(COUNTIF(A$1:A14,Référentiel_pour_Sphinx!$A$2:$A$300)=0,ROW(Référentiel_pour_Sphinx!$A$2:$A$300),9^9)))),\"\")","v":"CEFTAZIDIME"},null,null,null,null,null,null,null,null,null,null,null,null,null,"Divers"]
[{"$f":"IFERROR(INDEX(Référentiel_pour_Sphinx!$A:$A,MIN(IF(Référentiel_pour_Sphinx!$A$2:$A$300<>\"\",IF(COUNTIF(A$1:A15,Référentiel_pour_Sphinx!$A$2:$A$300)=0,ROW(Référentiel_pour_Sphinx!$A$2:$A$300),9^9)))),\"\")","v":"CEFTRIAXONE"}]
[{"$f":"IFERROR(INDEX(Référentiel_pour_Sphinx!$A:$A,MIN(IF(Référentiel_pour_Sphinx!$A$2:$A$300<>\"\",IF(COUNTIF(A$1:A16,Référentiel_pour_Sphinx!$A$2:$A$300)=0,ROW(Référentiel_pour_Sphinx!$A$2:$A$300),9^9)))),\"\")","v":"CHLORURE DE SODIUM"},null,null,null,null,null,null,null,null,"Méthode de saisie"]
[{"$f":"IFERROR(INDEX(Référentiel_pour_Sphinx!$A:$A,MIN(IF(Référentiel_pour_Sphinx!$A$2:$A$300<>\"\",IF(COUNTIF(A$1:A17,Référentiel_pour_Sphinx!$A$2:$A$300)=0,ROW(Référentiel_pour_Sphinx!$A$2:$A$300),9^9)))),\"\")","v":"ERTAPENEME"},null,null,null,null,null,null,null,null,"Saisie sur traitement de texte"]
[{"$f":"IFERROR(INDEX(Référentiel_pour_Sphinx!$A:$A,MIN(IF(Référentiel_pour_Sphinx!$A$2:$A$300<>\"\",IF(COUNTIF(A$1:A18,Référentiel_pour_Sphinx!$A$2:$A$300)=0,ROW(Référentiel_pour_Sphinx!$A$2:$A$300),9^9)))),\"\")","v":"GENTAMICINE"},null,null,null,null,null,null,null,null,"Manuscrit"]
[{"$f":"IFERROR(INDEX(Référentiel_pour_Sphinx!$A:$A,MIN(IF(Référentiel_pour_Sphinx!$A$2:$A$300<>\"\",IF(COUNTIF(A$1:A19,Référentiel_pour_Sphinx!$A$2:$A$300)=0,ROW(Référentiel_pour_Sphinx!$A$2:$A$300),9^9)))),\"\")","v":"HEPARINE SODIQUE"},null,null,null,null,null,null,null,null,"Issu du DPI avec libellé standardisé"]
[{"$f":"IFERROR(INDEX(Référentiel_pour_Sphinx!$A:$A,MIN(IF(Référentiel_pour_Sphinx!$A$2:$A$300<>\"\",IF(COUNTIF(A$1:A20,Référentiel_pour_Sphinx!$A$2:$A$300)=0,ROW(Référentiel_pour_Sphinx!$A$2:$A$300),9^9)))),\"\")","v":"HYDRATE DE CARBONE SOLUTE GLUCOSE"}]
[{"$f":"IFERROR(INDEX(Référentiel_pour_Sphinx!$A:$A,MIN(IF(Référentiel_pour_Sphinx!$A$2:$A$300<>\"\",IF(COUNTIF(A$1:A21,Référentiel_pour_Sphinx!$A$2:$A$300)=0,ROW(Référentiel_pour_Sphinx!$A$2:$A$300),9^9)))),\"\")","v":"HYDRATE DE CARBONE SOLUTE GLUCOSE POLYIONIQUE PRETS À L EMPLOI"}]
[{"$f":"IFERROR(INDEX(Référentiel_pour_Sphinx!$A:$A,MIN(IF(Référentiel_pour_Sphinx!$A$2:$A$300<>\"\",IF(COUNTIF(A$1:A22,Référentiel_pour_Sphinx!$A$2:$A$300)=0,ROW(Référentiel_pour_Sphinx!$A$2:$A$300),9^9)))),\"\")","v":"IMIPENEME CILASTATINE"}]
[{"$f":"IFERROR(INDEX(Référentiel_pour_Sphinx!$A:$A,MIN(IF(Référentiel_pour_Sphinx!$A$2:$A$300<>\"\",IF(COUNTIF(A$1:A23,Référentiel_pour_Sphinx!$A$2:$A$300)=0,ROW(Référentiel_pour_Sphinx!$A$2:$A$300),9^9)))),\"\")","v":"IMMUNOGLOBULINES POLYVALENTES IV"}]
[{"$f":"IFERROR(INDEX(Référentiel_pour_Sphinx!$A:$A,MIN(IF(Référentiel_pour_Sphinx!$A$2:$A$300<>\"\",IF(COUNTIF(A$1:A24,Référentiel_pour_Sphinx!$A$2:$A$300)=0,ROW(Référentiel_pour_Sphinx!$A$2:$A$300),9^9)))),\"\")","v":"IMMUNOGLOBULINES POLYVALENTES SC"}]
[{"$f":"IFERROR(INDEX(Référentiel_pour_Sphinx!$A:$A,MIN(IF(Référentiel_pour_Sphinx!$A$2:$A$300<>\"\",IF(COUNTIF(A$1:A25,Référentiel_pour_Sphinx!$A$2:$A$300)=0,ROW(Référentiel_pour_Sphinx!$A$2:$A$300),9^9)))),\"\")","v":"MEDICAMENT NON INTEGRE AU GUIDE DU ResOMeDIT"}]
[{"$f":"IFERROR(INDEX(Référentiel_pour_Sphinx!$A:$A,MIN(IF(Référentiel_pour_Sphinx!$A$2:$A$300<>\"\",IF(COUNTIF(A$1:A26,Référentiel_pour_Sphinx!$A$2:$A$300)=0,ROW(Référentiel_pour_Sphinx!$A$2:$A$300),9^9)))),\"\")","v":"MEROPENEME"}]
[{"$f":"IFERROR(INDEX(Référentiel_pour_Sphinx!$A:$A,MIN(IF(Référentiel_pour_Sphinx!$A$2:$A$300<>\"\",IF(COUNTIF(A$1:A27,Référentiel_pour_Sphinx!$A$2:$A$300)=0,ROW(Référentiel_pour_Sphinx!$A$2:$A$300),9^9)))),\"\")","v":"METHYLPREDNISOLONE"}]
[{"$f":"IFERROR(INDEX(Référentiel_pour_Sphinx!$A:$A,MIN(IF(Référentiel_pour_Sphinx!$A$2:$A$300<>\"\",IF(COUNTIF(A$1:A28,Référentiel_pour_Sphinx!$A$2:$A$300)=0,ROW(Référentiel_pour_Sphinx!$A$2:$A$300),9^9)))),\"\")","v":"MIDAZOLAM"}]
[{"$f":"IFERROR(INDEX(Référentiel_pour_Sphinx!$A:$A,MIN(IF(Référentiel_pour_Sphinx!$A$2:$A$300<>\"\",IF(COUNTIF(A$1:A29,Référentiel_pour_Sphinx!$A$2:$A$300)=0,ROW(Référentiel_pour_Sphinx!$A$2:$A$300),9^9)))),\"\")","v":"MORPHINE"}]
[{"$f":"IFERROR(INDEX(Référentiel_pour_Sphinx!$A:$A,MIN(IF(Référentiel_pour_Sphinx!$A$2:$A$300<>\"\",IF(COUNTIF(A$1:A30,Référentiel_pour_Sphinx!$A$2:$A$300)=0,ROW(Référentiel_pour_Sphinx!$A$2:$A$300),9^9)))),\"\")","v":"NEFOPAM"}]
[{"$f":"IFERROR(INDEX(Référentiel_pour_Sphinx!$A:$A,MIN(IF(Référentiel_pour_Sphinx!$A$2:$A$300<>\"\",IF(COUNTIF(A$1:A31,Référentiel_pour_Sphinx!$A$2:$A$300)=0,ROW(Référentiel_pour_Sphinx!$A$2:$A$300),9^9)))),\"\")","v":"OXACILLINE"}]
[{"$f":"IFERROR(INDEX(Référentiel_pour_Sphinx!$A:$A,MIN(IF(Référentiel_pour_Sphinx!$A$2:$A$300<>\"\",IF(COUNTIF(A$1:A32,Référentiel_pour_Sphinx!$A$2:$A$300)=0,ROW(Référentiel_pour_Sphinx!$A$2:$A$300),9^9)))),\"\")","v":"OXYCODONE"}]
[{"$f":"IFERROR(INDEX(Référentiel_pour_Sphinx!$A:$A,MIN(IF(Référentiel_pour_Sphinx!$A$2:$A$300<>\"\",IF(COUNTIF(A$1:A33,Référentiel_pour_Sphinx!$A$2:$A$300)=0,ROW(Référentiel_pour_Sphinx!$A$2:$A$300),9^9)))),\"\")","v":"PIPERACILLINE-TAZOBACTAM"}]
[{"$f":"IFERROR(INDEX(Référentiel_pour_Sphinx!$A:$A,MIN(IF(Référentiel_pour_Sphinx!$A$2:$A$300<>\"\",IF(COUNTIF(A$1:A34,Référentiel_pour_Sphinx!$A$2:$A$300)=0,ROW(Référentiel_pour_Sphinx!$A$2:$A$300),9^9)))),\"\")","v":"ROPIVACAINE"}]
[{"$f":"IFERROR(INDEX(Référentiel_pour_Sphinx!$A:$A,MIN(IF(Référentiel_pour_Sphinx!$A$2:$A$300<>\"\",IF(COUNTIF(A$1:A35,Référentiel_pour_Sphinx!$A$2:$A$300)=0,ROW(Référentiel_pour_Sphinx!$A$2:$A$300),9^9)))),\"\")","v":"TEICOPLANINE"}]
[{"$f":"IFERROR(INDEX(Référentiel_pour_Sphinx!$A:$A,MIN(IF(Référentiel_pour_Sphinx!$A$2:$A$300<>\"\",IF(COUNTIF(A$1:A36,Référentiel_pour_Sphinx!$A$2:$A$300)=0,ROW(Référentiel_pour_Sphinx!$A$2:$A$300),9^9)))),\"\")","v":"TEMOCILLINE"}]
[{"$f":"IFERROR(INDEX(Référentiel_pour_Sphinx!$A:$A,MIN(IF(Référentiel_pour_Sphinx!$A$2:$A$300<>\"\",IF(COUNTIF(A$1:A37,Référentiel_pour_Sphinx!$A$2:$A$300)=0,ROW(Référentiel_pour_Sphinx!$A$2:$A$300),9^9)))),\"\")","v":"TOBRAMYCINE"}]
[{"$f":"IFERROR(INDEX(Référentiel_pour_Sphinx!$A:$A,MIN(IF(Référentiel_pour_Sphinx!$A$2:$A$300<>\"\",IF(COUNTIF(A$1:A38,Référentiel_pour_Sphinx!$A$2:$A$300)=0,ROW(Référentiel_pour_Sphinx!$A$2:$A$300),9^9)))),\"\")","v":"VANCOMYCINE"}]
[{"$f":"IFERROR(INDEX(Référentiel_pour_Sphinx!$A:$A,MIN(IF(Référentiel_pour_Sphinx!$A$2:$A$300<>\"\",IF(COUNTIF(A$1:A39,Référentiel_pour_Sphinx!$A$2:$A$300)=0,ROW(Référentiel_pour_Sphinx!$A$2:$A$300),9^9)))),\"\")","v":""}]
[{"$f":"IFERROR(INDEX(Référentiel_pour_Sphinx!$A:$A,MIN(IF(Référentiel_pour_Sphinx!$A$2:$A$300<>\"\",IF(COUNTIF(A$1:A40,Référentiel_pour_Sphinx!$A$2:$A$300)=0,ROW(Référentiel_pour_Sphinx!$A$2:$A$300),9^9)))),\"\")","v":""}]

{"sheet":"Calcul","index":10,"n_rows":39,"n_cols":24,"rows_kept":39,"cut":false,"hidden":true,"merged":[]}
[null,"Effectifs","Taux de conformité global","Arrondis",null,null,{"$f":"Liste!$B$2","v":"IVD lente"},{"$f":"Liste!$B$3","v":"Gravité"},{"$f":"Liste!B4","v":"Diffuseur"},{"$f":"Liste!$B$5","v":"Système Actif Electrique"},{"$f":"Liste!$B$6","v":"Hors liste"},{"$f":"Liste!$B$7","v":"Non Renseigné"},"total",null,null,{"$f":"Liste!$J$2","v":"Formulaire de perfusion à domicile (Assurance Maladie)"},{"$f":"Liste!$J$3","v":"Formulaire protocolisé de l'établissement"},{"$f":"Liste!$J$4","v":"Ordonnance libre"},{"$f":"Liste!$J$5","v":"Ordonnance prérenseignée du prestataire"},"Tous",null,null,"DCI","Rang de non-conformité"]
[{"$f":"Liste!D4","v":"Conformité du mode d'administration"},{"$f":"COUNTIF('3 - Saisie'!$L$8:$L$107,A2)","v":0},{"$f":"IFERROR(COUNTIF('3 - Saisie'!$L$8:$L$107,A2)/COUNTA('3 - Saisie'!$L$8:$L$107),0)*100","v":0},{"$f":"ROUND(C2,0)","v":0},null,"Taux de saisie conforme",{"$f":"IFERROR(COUNTIFS('3 - Saisie'!$K$8:$K$106,Calcul!$G$1,'3 - Saisie'!$L$8:$L$106,Liste!$D4),0)","v":0},{"$f":"IFERROR(COUNTIFS('3 - Saisie'!$K$8:$K$106,Calcul!$H$1,'3 - Saisie'!$L$8:$L$106,Liste!$D4),0)","v":0},{"$f":"IFERROR(COUNTIFS('3 - Saisie'!$K$8:$K$106,Calcul!$I$1,'3 - Saisie'!$L$8:$L$106,Liste!$D4),0)","v":0},{"$f":"IFERROR(COUNTIFS('3 - Saisie'!$K$8:$K$106,Calcul!$J$1,'3 - Saisie'!$L$8:$L$106,Liste!$D4),0)","v":0},{"$f":"IFERROR(COUNTIFS('3 - Saisie'!$K$8:$K$106,Calcul!$K$1,'3 - Saisie'!$L$8:$L$106,Liste!$D4),0)","v":0},{"$f":"IFERROR(COUNTIFS('3 - Saisie'!$K$8:$K$106,Calcul!$L$1,'3 - Saisie'!$L$8:$L$106,Liste!$D4),0)","v":0},{"$f":"SUM(G2:L2)","v":0},null,"Taux de saisie conforme",{"$f":"IFERROR(COUNTIFS('3 - Saisie'!$L$8:$L$106,Liste!D4,'3 - Saisie'!$F$8:$F$106,$P$1),0)","v":0},{"$f":"IFERROR(COUNTIFS('3 - Saisie'!$L$8:$L$106,Liste!D4,'3 - Saisie'!$F$8:$F$106,$Q$1),0)","v":0},{"$f":"IFERROR(COUNTIFS('3 - Saisie'!$L$8:$L$106,Liste!D4,'3 - Saisie'!$F$8:$F$106,$R$1),0)","v":0},{"$f":"IFERROR(COUNTIFS('3 - Saisie'!$L$8:$L$106,Liste!D4,'3 - Saisie'!$F$8:$F$106,$S$1),0)","v":0},{"$f":"SUM(P2:S2)","v":0},null,null,{"$f":"'5 - Conformité par DCI'!B2","v":"(vide)"},{"$f":"IFERROR(RANK('5 - Conformité par DCI'!F2,'5 - Conformité par DCI'!$F$2:$F$39,0)+COUNTIF('5 - Conformité par DCI'!$F$2:F2,'5 - Conformité par DCI'!F2)-1,\"\")","v":""}]
[{"$f":"Liste!D5","v":"Modalité alternative d'administration"},{"$f":"COUNTIF('3 - Saisie'!$L$8:$L$107,A3)","v":0},{"$f":"IFERROR(COUNTIF('3 - Saisie'!$L$8:$L$107,A3)/COUNTA('3 - Saisie'!$L$8:$L$107),0)*100","v":0},0,null,"Taux de saisie d'une modalité alternative",{"$f":"IFERROR(COUNTIFS('3 - Saisie'!$K$8:$K$106,Calcul!$G$1,'3 - Saisie'!$L$8:$L$106,Liste!$D5),0)","v":0},{"$f":"IFERROR(COUNTIFS('3 - Saisie'!$K$8:$K$106,Calcul!$H$1,'3 - Saisie'!$L$8:$L$106,Liste!$D5),0)","v":0},{"$f":"IFERROR(COUNTIFS('3 - Saisie'!$K$8:$K$106,Calcul!$I$1,'3 - Saisie'!$L$8:$L$106,Liste!$D5),0)","v":0},{"$f":"IFERROR(COUNTIFS('3 - Saisie'!$K$8:$K$106,Calcul!$J$1,'3 - Saisie'!$L$8:$L$106,Liste!$D5),0)","v":0},{"$f":"IFERROR(COUNTIFS('3 - Saisie'!$K$8:$K$106,Calcul!$K$1,'3 - Saisie'!$L$8:$L$106,Liste!$D5),0)","v":0},{"$f":"IFERROR(COUNTIFS('3 - Saisie'!$K$8:$K$106,Calcul!$L$1,'3 - Saisie'!$L$8:$L$106,Liste!$D5),0)","v":0},0,null,"Taux de saisie d'une modalité alternative",{"$f":"IFERROR(COUNTIFS('3 - Saisie'!$L$8:$L$106,Liste!D5,'3 - Saisie'!$F$8:$F$106,$P$1),0)","v":0},{"$f":"IFERROR(COUNTIFS('3 - Saisie'!$L$8:$L$106,Liste!D5,'3 - Saisie'!$F$8:$F$106,$Q$1),0)","v":0},{"$f":"IFERROR(COUNTIFS('3 - Saisie'!$L$8:$L$106,Liste!D5,'3 - Saisie'!$F$8:$F$106,$R$1),0)","v":0},{"$f":"IFERROR(COUNTIFS('3 - Saisie'!$L$8:$L$106,Liste!D5,'3 - Saisie'!$F$8:$F$106,$S$1),0)","v":0},0,null,null,{"$f":"'5 - Conformité par DCI'!B3","v":""},{"$f":"IFERROR(RANK('5 - Conformité par DCI'!F3,'5 - Conformité par DCI'!$F$2:$F$39,0)+COUNTIF('5 - Conformité par DCI'!$F$2:F3,'5 - Conformité par DCI'!F3)-1,\"\")","v":""}]
[{"$f":"Liste!D6","v":"Non Conformité du mode d'administration"},{"$f":"COUNTIF('3 - Saisie'!$L$8:$L$107,A4)","v":0},{"$f":"IFERROR(COUNTIF('3 - Saisie'!$L$8:$L$107,A4)/COUNTA('3 - Saisie'!$L$8:$L$107),0)*100","v":0},0,null,"Taux de saisie Non conforme",{"$f":"IFERROR(COUNTIFS('3 - Saisie'!$K$8:$K$106,Calcul!$G$1,'3 - Saisie'!$L$8:$L$106,Liste!$D6),0)","v":0},{"$f":"IFERROR(COUNTIFS('3 - Saisie'!$K$8:$K$106,Calcul!$H$1,'3 - Saisie'!$L$8:$L$106,Liste!$D6),0)","v":0},{"$f":"IFERROR(COUNTIFS('3 - Saisie'!$K$8:$K$106,Calcul!$I$1,'3 - Saisie'!$L$8:$L$106,Liste!$D6),0)","v":0},{"$f":"IFERROR(COUNTIFS('3 - Saisie'!$K$8:$K$106,Calcul!$J$1,'3 - Saisie'!$L$8:$L$106,Liste!$D6),0)","v":0},{"$f":"IFERROR(COUNTIFS('3 - Saisie'!$K$8:$K$106,Calcul!$K$1,'3 - Saisie'!$L$8:$L$106,Liste!$D6),0)","v":0},{"$f":"IFERROR(COUNTIFS('3 - Saisie'!$K$8:$K$106,Calcul!$L$1,'3 - Saisie'!$L$8:$L$106,Liste!$D6),0)","v":0},0,null,"Taux de saisie Non conforme",{"$f":"IFERROR(COUNTIFS('3 - Saisie'!$L$8:$L$106,Liste!D6,'3 - Saisie'!$F$8:$F$106,$P$1),0)","v":0},{"$f":"IFERROR(COUNTIFS('3 - Saisie'!$L$8:$L$106,Liste!D6,'3 - Saisie'!$F$8:$F$106,$Q$1),0)","v":0},{"$f":"IFERROR(COUNTIFS('3 - Saisie'!$L$8:$L$106,Liste!D6,'3 - Saisie'!$F$8:$F$106,$R$1),0)","v":0},{"$f":"IFERROR(COUNTIFS('3 - Saisie'!$L$8:$L$106,Liste!D6,'3 - Saisie'!$F$8:$F$106,$S$1),0)","v":0},0,null,null,{"$f":"'5 - Conformité par DCI'!B4","v":""},{"$f":"IFERROR(RANK('5 - Conformité par DCI'!F4,'5 - Conformité par DCI'!$F$2:$F$39,0)+COUNTIF('5 - Conformité par DCI'!$F$2:F4,'5 - Conformité par DCI'!F4)-1,\"\")","v":""}]
[{"$f":"Liste!D7","v":"Non conformité : Prescription incomplète"},{"$f":"COUNTIF('3 - Saisie'!$L$8:$L$107,A5)","v":0},{"$f":"IFERROR(COUNTIF('3 - Saisie'!$L$8:$L$107,A5)/COUNTA('3 - Saisie'!$L$8:$L$107),0)*100","v":0},0,null,"Taux de presciption incomplète",{"$f":"IFERROR(COUNTIFS('3 - Saisie'!$K$8:$K$106,Calcul!$G$1,'3 - Saisie'!$L$8:$L$106,Liste!$D7),0)","v":0},{"$f":"IFERROR(COUNTIFS('3 - Saisie'!$K$8:$K$106,Calcul!$H$1,'3 - Saisie'!$L$8:$L$106,Liste!$D7),0)","v":0},{"$f":"IFERROR(COUNTIFS('3 - Saisie'!$K$8:$K$106,Calcul!$I$1,'3 - Saisie'!$L$8:$L$106,Liste!$D7),0)","v":0},{"$f":"IFERROR(COUNTIFS('3 - Saisie'!$K$8:$K$106,Calcul!$J$1,'3 - Saisie'!$L$8:$L$106,Liste!$D7),0)","v":0},{"$f":"IFERROR(COUNTIFS('3 - Saisie'!$K$8:$K$106,Calcul!$K$1,'3 - Saisie'!$L$8:$L$106,Liste!$D7),0)","v":0},{"$f":"IFERROR(COUNTIFS('3 - Saisie'!$K$8:$K$106,Calcul!$L$1,'3 - Saisie'!$L$8:$L$106,Liste!$D7),0)","v":0},0,null,"Taux de presciption incomplète",{"$f":"IFERROR(COUNTIFS('3 - Saisie'!$L$8:$L$106,Liste!D7,'3 - Saisie'!$F$8:$F$106,$P$1),0)","v":0},{"$f":"IFERROR(COUNTIFS('3 - Saisie'!$L$8:$L$106,Liste!D7,'3 - Saisie'!$F$8:$F$106,$Q$1),0)","v":0},{"$f":"IFERROR(COUNTIFS('3 - Saisie'!$L$8:$L$106,Liste!D7,'3 - Saisie'!$F$8:$F$106,$R$1),0)","v":0},{"$f":"IFERROR(COUNTIFS('3 - Saisie'!$L$8:$L$106,Liste!D7,'3 - Saisie'!$F$8:$F$106,$S$1),0)","v":0},0,null,null,{"$f":"'5 - Conformité par DCI'!B5","v":""},{"$f":"IFERROR(RANK('5 - Conformité par DCI'!F5,'5 - Conformité par DCI'!$F$2:$F$39,0)+COUNTIF('5 - Conformité par DCI'!$F$2:F5,'5 - Conformité par DCI'!F5)-1,\"\")","v":""}]
[{"$f":"Liste!D8","v":"Situation non intégrée dans le guide ResOMeDIT"},{"$f":"COUNTIF('3 - Saisie'!$L$8:$L$107,A6)","v":0},{"$f":"IFERROR(COUNTIF('3 - Saisie'!$L$8:$L$107,A6)/COUNTA('3 - Saisie'!$L$8:$L$107),0)*100","v":0},0,null,"Taux de saisie Hors Référentiel du ResOMeDIT",{"$f":"IFERROR(COUNTIFS('3 - Saisie'!$K$8:$K$106,Calcul!$G$1,'3 - Saisie'!$L$8:$L$106,Liste!$D8),0)","v":0},{"$f":"IFERROR(COUNTIFS('3 - Saisie'!$K$8:$K$106,Calcul!$H$1,'3 - Saisie'!$L$8:$L$106,Liste!$D8),0)","v":0},{"$f":"IFERROR(COUNTIFS('3 - Saisie'!$K$8:$K$106,Calcul!$I$1,'3 - Saisie'!$L$8:$L$106,Liste!$D8),0)","v":0},{"$f":"IFERROR(COUNTIFS('3 - Saisie'!$K$8:$K$106,Calcul!$J$1,'3 - Saisie'!$L$8:$L$106,Liste!$D8),0)","v":0},{"$f":"IFERROR(COUNTIFS('3 - Saisie'!$K$8:$K$106,Calcul!$K$1,'3 - Saisie'!$L$8:$L$106,Liste!$D8),0)","v":0},{"$f":"IFERROR(COUNTIFS('3 - Saisie'!$K$8:$K$106,Calcul!$L$1,'3 - Saisie'!$L$8:$L$106,Liste!$D8),0)","v":0},0,null,"Taux de saisie Hors Référentiel du ResOMeDIT",{"$f":"IFERROR(COUNTIFS('3 - Saisie'!$L$8:$L$106,Liste!D8,'3 - Saisie'!$F$8:$F$106,$P$1),0)","v":0},{"$f":"IFERROR(COUNTIFS('3 - Saisie'!$L$8:$L$106,Liste!D8,'3 - Saisie'!$F$8:$F$106,$Q$1),0)","v":0},{"$f":"IFERROR(COUNTIFS('3 - Saisie'!$L$8:$L$106,Liste!D8,'3 - Saisie'!$F$8:$F$106,$R$1),0)","v":0},{"$f":"IFERROR(COUNTIFS('3 - Saisie'!$L$8:$L$106,Liste!D8,'3 - Saisie'!$F$8:$F$106,$S$1),0)","v":0},0,null,null,{"$f":"'5 - Conformité par DCI'!B6","v":""},{"$f":"IFERROR(RANK('5 - Conformité par DCI'!F6,'5 - Conformité par DCI'!$F$2:$F$39,0)+COUNTIF('5 - Conformité par DCI'!$F$2:F6,'5 - Conformité par DCI'!F6)-1,\"\")","v":""}]
[{"$f":"Liste!D9","v":"Saisie Incomplète"},{"$f":"COUNTIF('3 - Saisie'!$L$8:$L$107,A7)","v":0},{"$f":"IFERROR(COUNTIF('3 - Saisie'!$L$8:$L$107,A7)/COUNTA('3 - Saisie'!$L$8:$L$107),0)*100","v":0},0,null,"Taux de Saisie Incomplète",{"$f":"IFERROR(COUNTIFS('3 - Saisie'!$K$8:$K$106,Calcul!$G$1,'3 - Saisie'!$L$8:$L$106,Liste!$D9),0)","v":0},{"$f":"IFERROR(COUNTIFS('3 - Saisie'!$K$8:$K$106,Calcul!$H$1,'3 - Saisie'!$L$8:$L$106,Liste!$D9),0)","v":0},{"$f":"IFERROR(COUNTIFS('3 - Saisie'!$K$8:$K$106,Calcul!$I$1,'3 - Saisie'!$L$8:$L$106,Liste!$D9),0)","v":0},{"$f":"IFERROR(COUNTIFS('3 - Saisie'!$K$8:$K$106,Calcul!$J$1,'3 - Saisie'!$L$8:$L$106,Liste!$D9),0)","v":0},{"$f":"IFERROR(COUNTIFS('3 - Saisie'!$K$8:$K$106,Calcul!$K$1,'3 - Saisie'!$L$8:$L$106,Liste!$D9),0)","v":0},{"$f":"IFERROR(COUNTIFS('3 - Saisie'!$K$8:$K$106,Calcul!$L$1,'3 - Saisie'!$L$8:$L$106,Liste!$D9),0)","v":0},0,null,"Taux de Saisie Incomplète",{"$f":"IFERROR(COUNTIFS('3 - Saisie'!$L$8:$L$106,Liste!D9,'3 - Saisie'!$F$8:$F$106,$P$1),0)","v":0},{"$f":"IFERROR(COUNTIFS('3 - Saisie'!$L$8:$L$106,Liste!D9,'3 - Saisie'!$F$8:$F$106,$Q$1),0)","v":0},{"$f":"IFERROR(COUNTIFS('3 - Saisie'!$L$8:$L$106,Liste!D9,'3 - Saisie'!$F$8:$F$106,$R$1),0)","v":0},{"$f":"IFERROR(COUNTIFS('3 - Saisie'!$L$8:$L$106,Liste!D9,'3 - Saisie'!$F$8:$F$106,$S$1),0)","v":0},0,null,null,{"$f":"'5 - Conformité par DCI'!B7","v":""},{"$f":"IFERROR(RANK('5 - Conformité par DCI'!F7,'5 - Conformité par DCI'!$F$2:$F$39,0)+COUNTIF('5 - Conformité par DCI'!$F$2:F7,'5 - Conformité par DCI'!F7)-1,\"\")","v":""}]
[null,null,null,null,null,"Effectif (saisie incomplète et hors réf exclu)",{"$f":"SUM(G2:G5)","v":0},{"$f":"SUM(H2:H5)","v":0},0,0,0,0,0,null,"Effectif (saisie incomplète et hors réf exclu)",{"$f":"SUM(P2:P5)","v":0},{"$f":"SUM(Q2:Q5)","v":0},0,0,0,null,null,{"$f":"'5 - Conformité par DCI'!B8","v":""},{"$f":"IFERROR(RANK('5 - Conformité par DCI'!F8,'5 - Conformité par DCI'!$F$2:$F$39,0)+COUNTIF('5 - Conformité par DCI'!$F$2:F8,'5 - Conformité par DCI'!F8)-1,\"\")","v":""}]
[null,null,null,null,null,"Répartition du mode d'administration",{"$f":"IFERROR(G8/(SUM($G$8:$L$8)),0)","v":0},0,0,0,0,0,{"$f":"IFERROR(M8/COUNTA('3 - Saisie'!L8:L106),0)","v":0},null,"Répartition du support de prescription",{"$f":"IFERROR(P8/$T$8,0)","v":0},{"$f":"IFERROR(Q8/$T$8,0)","v":0},{"$f":"IFERROR(R8/$T$8,0)","v":0},{"$f":"IFERROR(S8/$T$8,0)","v":0},{"$f":"IFERROR(T8/COUNTA('3 - Saisie'!L8:L106),0)","v":0},null,null,{"$f":"'5 - Conformité par DCI'!B9","v":""},{"$f":"IFERROR(RANK('5 - Conformité par DCI'!F9,'5 - Conformité par DCI'!$F$2:$F$39,0)+COUNTIF('5 - Conformité par DCI'!$F$2:F9,'5 - Conformité par DCI'!F9)-1,\"\")","v":""}]
["NB de doses non remplie",{"$f":"COUNTA('3 - Saisie'!L8:L107)-COUNTA('3 - Saisie'!I8:I107)","v":0},null,null,null,null,null,null,null,null,null,"NB de non rempli",{"$f":"COUNTA('3 - Saisie'!$L$8:$L$106)-COUNTA('3 - Saisie'!$K$8:$K$106)","v":0},null,null,null,null,null,"NB de non rempli",{"$f":"COUNTA('3 - Saisie'!L8:L106)-COUNTA('3 - Saisie'!F8:F106)","v":0},null,null,{"$f":"'5 - Conformité par DCI'!B10","v":""},{"$f":"IFERROR(RANK('5 - Conformité par DCI'!F10,'5 - Conformité par DCI'!$F$2:$F$39,0)+COUNTIF('5 - Conformité par DCI'!$F$2:F10,'5 - Conformité par DCI'!F10)-1,\"\")","v":""}]
["% de doses non remplie",{"$f":"(1-(COUNTA('3 - Saisie'!I8:I107)/COUNTA('3 - Saisie'!L8:L107)))*100","v":{"$error":"#DIV/0!"}},null,null,null,null,null,null,null,null,null,"% de non remplie",{"$f":"(1-(COUNTA('3 - Saisie'!K8:K106)/COUNTA('3 - Saisie'!L8:L106)))*100","v":{"$error":"#DIV/0!"}},null,null,null,null,null,"% de non remplie",{"$f":"(1-(COUNTA('3 - Saisie'!F8:F106)/COUNTA('3 - Saisie'!L8:L106)))*100","v":{"$error":"#DIV/0!"}},null,null,{"$f":"'5 - Conformité par DCI'!B11","v":""},{"$f":"IFERROR(RANK('5 - Conformité par DCI'!F11,'5 - Conformité par DCI'!$F$2:$F$39,0)+COUNTIF('5 - Conformité par DCI'!$F$2:F11,'5 - Conformité par DCI'!F11)-1,\"\")","v":""}]
["%arrondi de doses non remplie",{"$f":"ROUND(B11,0)","v":{"$error":"#DIV/0!"}},null,null,null,null,null,null,null,null,null,"% arrondi",{"$f":"ROUND(M11,0)","v":{"$error":"#DIV/0!"}},null,null,null,null,null,"% arrondi",{"$f":"ROUND(T11,0)","v":{"$error":"#DIV/0!"}},null,null,{"$f":"'5 - Conformité par DCI'!B12","v":""},{"$f":"IFERROR(RANK('5 - Conformité par DCI'!F12,'5 - Conformité par DCI'!$F$2:$F$39,0)+COUNTIF('5 - Conformité par DCI'!$F$2:F12,'5 - Conformité par DCI'!F12)-1,\"\")","v":""}]
[null,null,null,null,null,null,null,null,null,null,null,null,null,null,null,null,null,null,null,null,null,null,{"$f":"'5 - Conformité par DCI'!B13","v":""},{"$f":"IFERROR(RANK('5 - Conformité par DCI'!F13,'5 - Conformité par DCI'!$F$2:$F$39,0)+COUNTIF('5 - Conformité par DCI'!$F$2:F13,'5 - Conformité par DCI'!F13)-1,\"\")","v":""}]
[null,null,null,null,null,null,null,null,null,null,null,null,null,null,null,null,null,null,null,null,null,null,{"$f":"'5 - Conformité par DCI'!B14","v":""},{"$f":"IFERROR(RANK('5 - Conformité par DCI'!F14,'5 - Conformité par DCI'!$F$2:$F$39,0)+COUNTIF('5 - Conformité par DCI'!$F$2:F14,'5 - Conformité par DCI'!F14)-1,\"\")","v":""}]
["Effectif de support issu du DPI",{"$f":"COUNTIF('3 - Saisie'!G:G,Liste!$J$18)","v":0},"Taux de support issu du DPI",{"$f":"IFERROR((B15/COUNTA('3 - Saisie'!G8:G107))*100,0)","v":0},{"$f":"ROUND(D15,0)","v":0},null,null,null,null,null,null,null,null,null,null,null,null,null,null,null,null,null,{"$f":"'5 - Conformité par DCI'!B15","v":""},{"$f":"IFERROR(RANK('5 - Conformité par DCI'!F15,'5 - Conformité par DCI'!$F$2:$F$39,0)+COUNTIF('5 - Conformité par DCI'!$F$2:F15,'5 - Conformité par DCI'!F15)-1,\"\")","v":""}]
["Effectif support informatique",{"$f":"COUNTIF('3 - Saisie'!G:G,Liste!$J$19)","v":0},"Taux support informatique",{"$f":"IFERROR((B16/COUNTA('3 - Saisie'!G8:G107))*100,0)","v":0},{"$f":"ROUND(D16,0)","v":0},null,null,null,null,null,null,null,null,null,null,null,null,null,null,null,null,null,{"$f":"'5 - Conformité par DCI'!B16","v":""},{"$f":"IFERROR(RANK('5 - Conformité par DCI'!F16,'5 - Conformité par DCI'!$F$2:$F$39,0)+COUNTIF('5 - Conformité par DCI'!$F$2:F16,'5 - Conformité par DCI'!F16)-1,\"\")","v":""}]
["Effectif support papier",{"$f":"COUNTIF('3 - Saisie'!G:G,Liste!$J$20)","v":0},"Taux support papier",{"$f":"IFERROR((B17/COUNTA('3 - Saisie'!G8:G107))*100,0)","v":0},{"$f":"ROUND(D17,0)","v":0},null,null,null,null,null,null,null,null,null,null,null,null,null,null,null,null,null,{"$f":"'5 - Conformité par DCI'!B17","v":""},{"$f":"IFERROR(RANK('5 - Conformité par DCI'!F17,'5 - Conformité par DCI'!$F$2:$F$39,0)+COUNTIF('5 - Conformité par DCI'!$F$2:F17,'5 - Conformité par DCI'!F17)-1,\"\")","v":""}]
[null,null,null,null,null,null,null,null,null,null,null,null,null,null,null,null,null,null,null,null,null,null,{"$f":"'5 - Conformité par DCI'!B18","v":""},{"$f":"IFERROR(RANK('5 - Conformité par DCI'!F18,'5 - Conformité par DCI'!$F$2:$F$39,0)+COUNTIF('5 - Conformité par DCI'!$F$2:F18,'5 - Conformité par DCI'!F18)-1,\"\")","v":""}]
[null,null,null,null,null,null,null,null,null,null,null,null,null,null,null,null,null,null,null,null,null,null,{"$f":"'5 - Conformité par DCI'!B19","v":""},{"$f":"IFERROR(RANK('5 - Conformité par DCI'!F19,'5 - Conformité par DCI'!$F$2:$F$39,0)+COUNTIF('5 - Conformité par DCI'!$F$2:F19,'5 - Conformité par DCI'!F19)-1,\"\")","v":""}]
[null,null,null,null,null,null,null,null,null,null,null,null,null,null,null,null,null,null,null,null,null,null,{"$f":"'5 - Conformité par DCI'!B20","v":""},{"$f":"IFERROR(RANK('5 - Conformité par DCI'!F20,'5 - Conformité par DCI'!$F$2:$F$39,0)+COUNTIF('5 - Conformité par DCI'!$F$2:F20,'5 - Conformité par DCI'!F20)-1,\"\")","v":""}]
[null,null,null,null,null,null,null,null,null,null,null,null,null,null,null,null,null,null,null,null,null,null,{"$f":"'5 - Conformité par DCI'!B21","v":""},{"$f":"IFERROR(RANK('5 - Conformité par DCI'!F21,'5 - Conformité par DCI'!$F$2:$F$39,0)+COUNTIF('5 - Conformité par DCI'!$F$2:F21,'5 - Conformité par DCI'!F21)-1,\"\")","v":""}]
[null,null,null,null,null,null,null,null,null,null,null,null,null,null,null,null,null,null,null,null,null,null,{"$f":"'5 - Conformité par DCI'!B22","v":""},{"$f":"IFERROR(RANK('5 - Conformité par DCI'!F22,'5 - Conformité par DCI'!$F$2:$F$39,0)+COUNTIF('5 - Conformité par DCI'!$F$2:F22,'5 - Conformité par DCI'!F22)-1,\"\")","v":""}]
[null,null,null,null,null,null,null,null,null,null,null,null,null,null,null,null,null,null,null,null,null,null,{"$f":"'5 - Conformité par DCI'!B23","v":""},{"$f":"IFERROR(RANK('5 - Conformité par DCI'!F23,'5 - Conformité par DCI'!$F$2:$F$39,0)+COUNTIF('5 - Conformité par DCI'!$F$2:F23,'5 - Conformité par DCI'!F23)-1,\"\")","v":""}]
[null,null,null,null,null,null,null,null,null,null,null,null,null,null,null,null,null,null,null,null,null,null,{"$f":"'5 - Conformité par DCI'!B24","v":""},{"$f":"IFERROR(RANK('5 - Conformité par DCI'!F24,'5 - Conformité par DCI'!$F$2:$F$39,0)+COUNTIF('5 - Conformité par DCI'!$F$2:F24,'5 - Conformité par DCI'!F24)-1,\"\")","v":""}]
[null,null,null,null,null,null,null,null,null,null,null,null,null,null,null,null,null,null,null,null,null,null,{"$f":"'5 - Conformité par DCI'!B25","v":""},{"$f":"IFERROR(RANK('5 - Conformité par DCI'!F25,'5 - Conformité par DCI'!$F$2:$F$39,0)+COUNTIF('5 - Conformité par DCI'!$F$2:F25,'5 - Conformité par DCI'!F25)-1,\"\")","v":""}]
[null,null,null,null,null,null,null,null,null,null,null,null,null,null,null,null,null,null,null,null,null,null,{"$f":"'5 - Conformité par DCI'!B26","v":""},{"$f":"IFERROR(RANK('5 - Conformité par DCI'!F26,'5 - Conformité par DCI'!$F$2:$F$39,0)+COUNTIF('5 - Conformité par DCI'!$F$2:F26,'5 - Conformité par DCI'!F26)-1,\"\")","v":""}]
[null,null,null,null,null,null,null,null,null,null,null,null,null,null,null,null,null,null,null,null,null,null,{"$f":"'5 - Conformité par DCI'!B27","v":""},{"$f":"IFERROR(RANK('5 - Conformité par DCI'!F27,'5 - Conformité par DCI'!$F$2:$F$39,0)+COUNTIF('5 - Conformité par DCI'!$F$2:F27,'5 - Conformité par DCI'!F27)-1,\"\")","v":""}]
[null,null,null,null,null,null,null,null,null,null,null,null,null,null,null,null,null,null,null,null,null,null,{"$f":"'5 - Conformité par DCI'!B28","v":""},{"$f":"IFERROR(RANK('5 - Conformité par DCI'!F28,'5 - Conformité par DCI'!$F$2:$F$39,0)+COUNTIF('5 - Conformité par DCI'!$F$2:F28,'5 - Conformité par DCI'!F28)-1,\"\")","v":""}]
[null,null,null,null,null,null,null,null,null,null,null,null,null,null,null,null,null,null,null,null,null,null,{"$f":"'5 - Conformité par DCI'!B29","v":""},{"$f":"IFERROR(RANK('5 - Conformité par DCI'!F29,'5 - Conformité par DCI'!$F$2:$F$39,0)+COUNTIF('5 - Conformité par DCI'!$F$2:F29,'5 - Conformité par DCI'!F29)-1,\"\")","v":""}]
[null,null,null,null,null,null,null,null,null,null,null,null,null,null,null,null,null,null,null,null,null,null,{"$f":"'5 - Conformité par DCI'!B30","v":""},{"$f":"IFERROR(RANK('5 - Conformité par DCI'!F30,'5 - Conformité par DCI'!$F$2:$F$39,0)+COUNTIF('5 - Conformité par DCI'!$F$2:F30,'5 - Conformité par DCI'!F30)-1,\"\")","v":""}]
[null,null,null,null,null,null,null,null,null,null,null,null,null,null,null,null,null,null,null,null,null,null,{"$f":"'5 - Conformité par DCI'!B31","v":""},{"$f":"IFERROR(RANK('5 - Conformité par DCI'!F31,'5 - Conformité par DCI'!$F$2:$F$39,0)+COUNTIF('5 - Conformité par DCI'!$F$2:F31,'5 - Conformité par DCI'!F31)-1,\"\")","v":""}]
[null,null,null,null,null,null,null,null,null,null,null,null,null,null,null,null,null,null,null,null,null,null,{"$f":"'5 - Conformité par DCI'!B32","v":""},{"$f":"IFERROR(RANK('5 - Conformité par DCI'!F32,'5 - Conformité par DCI'!$F$2:$F$39,0)+COUNTIF('5 - Conformité par DCI'!$F$2:F32,'5 - Conformité par DCI'!F32)-1,\"\")","v":""}]
[null,null,null,null,null,null,null,null,null,null,null,null,null,null,null,null,null,null,null,null,null,null,{"$f":"'5 - Conformité par DCI'!B33","v":""},{"$f":"IFERROR(RANK('5 - Conformité par DCI'!F33,'5 - Conformité par DCI'!$F$2:$F$39,0)+COUNTIF('5 - Conformité par DCI'!$F$2:F33,'5 - Conformité par DCI'!F33)-1,\"\")","v":""}]
[null,null,null,null,null,null,null,null,null,null,null,null,null,null,null,null,null,null,null,null,null,null,{"$f":"'5 - Conformité par DCI'!B34","v":""},{"$f":"IFERROR(RANK('5 - Conformité par DCI'!F34,'5 - Conformité par DCI'!$F$2:$F$39,0)+COUNTIF('5 - Conformité par DCI'!$F$2:F34,'5 - Conformité par DCI'!F34)-1,\"\")","v":""}]
[null,null,null,null,null,null,null,null,null,null,null,null,null,null,null,null,null,null,null,null,null,null,{"$f":"'5 - Conformité par DCI'!B35","v":""},{"$f":"IFERROR(RANK('5 - Conformité par DCI'!F35,'5 - Conformité par DCI'!$F$2:$F$39,0)+COUNTIF('5 - Conformité par DCI'!$F$2:F35,'5 - Conformité par DCI'!F35)-1,\"\")","v":""}]
[null,null,null,null,null,null,null,null,null,null,null,null,null,null,null,null,null,null,null,null,null,null,{"$f":"'5 - Conformité par DCI'!B36","v":""},{"$f":"IFERROR(RANK('5 - Conformité par DCI'!F36,'5 - Conformité par DCI'!$F$2:$F$39,0)+COUNTIF('5 - Conformité par DCI'!$F$2:F36,'5 - Conformité par DCI'!F36)-1,\"\")","v":""}]
[null,null,null,null,null,null,null,null,null,null,null,null,null,null,null,null,null,null,null,null,null,null,{"$f":"'5 - Conformité par DCI'!B37","v":""},{"$f":"IFERROR(RANK('5 - Conformité par DCI'!F37,'5 - Conformité par DCI'!$F$2:$F$39,0)+COUNTIF('5 - Conformité par DCI'!$F$2:F37,'5 - Conformité par DCI'!F37)-1,\"\")","v":""}]
[null,null,null,null,null,null,null,null,null,null,null,null,null,null,null,null,null,null,null,null,null,null,{"$f":"'5 - Conformité par DCI'!B38","v":""},{"$f":"IFERROR(RANK('5 - Conformité par DCI'!F38,'5 - Conformité par DCI'!$F$2:$F$39,0)+COUNTIF('5 - Conformité par DCI'!$F$2:F38,'5 - Conformité par DCI'!F38)-1,\"\")","v":""}]
[null,null,null,null,null,null,null,null,null,null,null,null,null,null,null,null,null,null,null,null,null,null,{"$f":"'5 - Conformité par DCI'!B39","v":""},{"$f":"IFERROR(RANK('5 - Conformité par DCI'!F39,'5 - Conformité par DCI'!$F$2:$F$39,0)+COUNTIF('5 - Conformité par DCI'!$F$2:F39,'5 - Conformité par DCI'!F39)-1,\"\")","v":""}]

{"sheet":"GBP V4 (29012025)","index":11,"n_rows":47,"n_cols":12,"rows_kept":47,"cut":false,"hidden":false,"merged":[]}
["DCI","Conditions de prescription et de délivrance ","Reconstitution\n(solvant et volume)","Posologie (dose et fréquence de perfusion)","Voie","Dilution","Mode d’administration préconisé dans le cadre d'une administration par perfusion ","Mode d’administration alternatif","Orientation vers SAE","Commentaire","Autres voies d'administration injectables (hors Perfadom)","Références bibliographiques"]
["CLASSE ATC ANTI INFECTIEUX A USAGE SYSTEMIQUE"]
["Amikacine","Prescription Hospitalière\nDisponible en ville","EPPI \n1g dans 5mL\n500 mg dans 4mL\n250mg dans 2mL\nOu prêt a l'emploi","25 à 30 mg/kg en perfusion de 30 min en dose unique journalière","IV","NaCl 0.9%\nCmax 10 mg/mL","Gravité 30 min",null,"non","Index thérapeutique étroit\nEfficacité concentration dépendante\nSurveillance : Dosage pic plasmatique si besoin et concentrations résiduelles si durée > 5 jours ou IR","Voie IM possible\nLa voie intramusculaire est à éviter dans la mesure du possible, mais peut être pratiquée à titre exceptionnel en tenant compte que cette voie n'offre pas les mêmes garanties que la voie intraveineuse.","RCP\nDISPO\nPOSO\nAN1"]
["Amoxicilline","Disponible en ville","EPPI\n1g dans 20 mL\n2g dans 40 mL","Posologie standard : \n50 à 100 mg/kg/j toutes les 6 à 8 h\n                                                                                     \nForte posologie :\nAdministration discontinue : \n100 à 200mg/kg/j toutes les 4h en perfusion de 30 min\n\nAdministration continue : \n100 à 200mg/kg/j après une dose de charge de 2g sur 1 heure\n\nNE PAS DEPASSER 12g/j","IV","Gravité : NaCl 0,9% 100 mL (Cmax 20 mg/mL)\nDiffuseur : NaCl 0,9%, volume à adapter (Cmax 12,5 mg/mL)","En cas d'administration discontinue :\nGravité 30 min\nEn cas de perfusion continue et en fonction de la mobilité du patient :\nDiffuseur sur 12h (respecter la Cmax)",null,null,"Hyperhydratation si > 2g par perfusion pour diminuer le risque de cristallurie","Voies IM et IVD lente ","RCP\nDISPO\nPOSO\nAMX1"]
["Amoxicilline- acide clavulanique","Disponible en ville","EPPI\n1g dans 20 mL\n2g dans 20 mL","Posologie standard : \n1g/0,2g toutes les 8 à 6h en perfusion de 30 min\n                                                                                                \nForte posologie :\n2g/0,2g toutes les 8h en perfusion de 30 min","IV","NaCl 0,9% 100 mL\nCmax 20 mg/mL","Gravité 30 min",null,"non","Stabilité altérée avec le G5%\nDurée max de perfusion : 60 min\nNe pas dépasser 1200 mg/j d’acide clavulanique/j (attention : présentation à 1 g/200mg et 2 g/200mg)","Voie IVD lente ","RCP\nDISPO\nPOSO\nIDNow"]
["Amphotericine B \nFUNGIZONE","Prescription Hospitalière\nRétrocédable ","EPPI\n50 mg dans 10mL","Dose-test initiale de 1 mg puis 0,3 mg/kg 1 fois par jour\nLa dose peut éventuellement être augmentée en fonction de la situation clinique du patient.","IV","Glucose 5%\nINCOMPATIBLE NaCl\nDose test : 1 mg dans 20 mL de G5%\nPerfusion : Cmax 0,1mg/mL","Dose test : IV lente (20-30 minutes) \nPompe administration en 2 à 6h","Gravité 2 à 6 heures si envisageable","instabilité en diffuseur","Ce médicament ne doit pas être administré par une ligne intraveineuse ayant contenu du chlorure de sodium à 0,9 % sauf si cette ligne a d'abord été rincée avec une solution injectable de glucose\nCompte-tenu des risques allergiques, une dose-test initiale (1 mg dans 20 mL de soluté glucose à 5 %) peut être administrée par voie intraveineuse pendant 20 à 30 minutes. La température, le pouls, la respiration et la pression artérielle seront enregistrés toutes les 30 minutes pendant 2 à 3 heures.\nUne filtration membranaire \"in-line\" peut être utilisée pour la perfusion; cependant, le diamètre moyen du pore de la membrane filtrante ne devra pas être inférieur à 1 µm afin de permettre le passage de la dispersion colloïdale",null,"RCP\nDISPO\nAMB1\nAMB2\nAMB3"]
["Amphotericine B liposomale \nAMBISOME","Prescription Hospitalière\nRétrocédable ","EPPI\n50 mg dans 12mL\nAgiter vigoureusement le flacon pendant au moins 30 secondes  jusqu’à dispersion complète","3 mg/kg 1 fois par jour\nLa dose peut éventuellement être augmentée en fonction de la situation clinique du patient.","IV","Glucose 5%\nINCOMPATIBLE NaCl\nConcentration comprise entre 0,20 mg/mL à 2 mg/mL d'amphotéricine\nUtiliser le filtre de 5 microns fourni pour injecter la suspension d'Ambisome reconstituée dans la poche de G5%","Gravité 30-60 min (prolonger la durée si perfusion mal tolérée)","Pompe (si perfusion de 2 à 4 heures en cas de posologie supérieure à 3mg/kg/j)","instabilité en diffuseur","Ce médicament ne doit pas être administré par une ligne intraveineuse ayant contenu du chlorure de sodium à 0,9 % sauf si cette ligne a d'abord été rincée avec une solution injectable de glucose\nUne membrane filtrante sur le trajet du cathéter peut être utilisée lors de la perfusion intraveineuse de ce médicament. Cependant, le diamètre moyen des pores du filtre ne devra pas être inférieur à 1,0 micron.\nAbsence de données de stabilité en diffuseur",null,"RCP\nDISPO\nStabilis\nAMB1"]
["Aztréonam","Prescription Hospitalière\nDisponible en ville","EPPI\n1g dans 3 mL si perfusion\n1g dans 10 mL si IVD","Posologie standard : \nAdministration discontinue\n1g toutes les 8h en perfusion de 30 min\n\nAdministration continue\n2g par jour après dose de charge de 2g en perfusion de 30 min\n                                                                                     \nForte posologie :\nAdministration discontinue\n2g toutes les 6h en perfusion de 30 min\n\nAdministration continue :\n ≥ 6g/j après une dose de charge de 2g en perfusion de 30 min","IV","Gravité : NaCl 0,9% 100mL (Cmax 125mg/mL)\nDiffuseur NaCl 0,9% \n(Cmax 50mg/mL)","Perfusion continue :\nDiffuseur sur 24h (respecter Cmax)\nAdministration discontinue : \nGravité 30 min",null,"non","Ne doit pas être mélangé avec d'autres médicaments ou antibiotiques","Voies IM et IVD lente ","RCP\nDISPO\nPOSO\nSTAB"]
["Caspofungine","Prescription Hospitalière\nRétrocédable ","EPPI \n50mg dans 10,5mL\n70mg dans 10,5mL","J1 : 70 mg 1/j\nA partir de J2 :  50mg 1/j (sauf si poids >80kg : 70mg 1/j)","IV","50mg : NaCl 0.9% 100 mL\n70mg : NaCl 0.9% 250 mL\n(Ne pas utiliser  des solutions contenant du glucose)\nCmax 0,5 mg/mL","Gravité 60 min","En cas de mobilité du patient :\n50mg : Diffuseur vol mini 100 mL 60 min\n70mg : Diffuseur vol mini 250 mL 60 min","non","Solution concentrée reconstituée : peut être conservé jusqu’à 24 heures à une température ne dépassant pas 25°C.\nNe doit pas être mélangé avec d'autres médicaments.\nA partir de J2 :  70mg 1/j si association avec un inducteur enzymatique",null,"RCP\nDISPO\nStabilis"]
["Céfépime hors infection à Pseudomonas spp","Prescription Hospitalière\nDisponible en ville","EPPI\n1g dans 10 mL\n2g dans 10 mL","Posologie standard:\n1g toutes les 8h en perfusion de 30 min\n                                                                                     \nForte posologie :\nAdministration discontinue :\n2g toutes les 8h en perfusion de 30 min\n\nAdministration continue :\n≥ 4g/j après dose de charge de 2g en perfusion de 30 min","IV","Gravité NaCl 0,9% 100 mL (Cmax 125mg/mL)\nDiffuseur : NaCl 0,9% (Cmax 12,5 mg/mL)","Perfusion continue : Diffuseur sur 12h (respecter la Cmax)\nAdministration discontinue : Gravité 30 min",null,null,"Peut prendre une coloration jaune ambrée sans perte d'activité. \nNe doit pas être mélangé avec d'autres médicaments","Possibilité d'administration du 1g en IM profonde\nVoie IVD lente","RCP\nDISPO\nPOSO\nIDNow"]
["Céfépime infection à Pseudomonas spp","Prescription Hospitalière\nDisponible en ville","EPPI\n1g dans 10 mL\n2g dans 10 mL","Forte posologie :\nAdministration discontinue :\n2g toutes les 6h en perfusion de 30 min\n\nAdministration continue :\n≥ 6g/j après dose de charge de 2g en perfusion de 30 min","IV","Gravité NaCl 0,9% 100 mL (Cmax 125mg/mL)\nDiffuseur : NaCl 0,9% (Cmax 12,5 mg/mL)","Perfusion continue : Diffuseur sur 12h (respecter la Cmax)\nAdministration discontinue :  Gravité 30 min",null,null,"Peut prendre une coloration jaune ambrée sans perte d'activité. Ne doit pas être mélangé avec d'autres médicaments","Possibilité d'administration du 1g en IM profonde\nVoie IVD lente","RCP\nDISPO\nPOSO\nIDNow"]
["Céfoxitine","Prescription Hospitalière\nRétrocédable ","EPPI\n1g dans 10 mL\n2g dans 10 mL","Administration continue : \n≥ 8 g/jour après dose de charge de 2 g sur 30 min","IV","NaCl 0,9%\nCmax 12,5 mg/mL","Perfusion continue : Diffuseur sur 12h (respecter la Cmax)",null,null,null,"Voie IVD lente","RCP\nDISPO\nPOSO"]
["Ceftazidime","Prescription Hospitalière\nDisponible en ville","EPPI\n1g dans 10mL\n2g dans 10mL\n(Facteur de déplacement \nDégagement gazeux)","Posologie standard :\nAdministration discontinue : \n1g toutes les 8h en perfusion de 30 min\n\nAdministration continue : \n2g par jour après dose de charge de 2g en perfusion de 30 min\n                                                                                     \nForte posologie :\nAdministration discontinue : \n2g toutes les 8h en perfusion de 30 min\n\nAdministration continue :\n≥ 4g/j après dose de charge de 2g en perfusion de 30 min","IV","Gravité : NaCl 0,9% 100 mL (Cmax 125 mg/mL)\nDiffuseur : NaCl 0,9%, volume à adapter (Cmax 25 mg/mL)","Perfusion continue :\nDiffuseur sur 12h (respecter Cmax)\nAdministration discontinue :\nGravité 30 min",null,"non",null,"Voie IVD lente\nL'administration intramusculaire doit uniquement être envisagée lorsque la voie intraveineuse n'est pas possible ou est moins appropriée pour le patient.","RCP\nDISPO\nPOSO\nIDNow"]
["Ceftriaxone","Disponible en ville","EPPI\n1g  dans 10 mL\n2g dans 20 mL ","Posologie standard : \n1 à 2g toutes les 24h\n                                                                                     \nForte posologie :\n2g toutes les 12h","IV","NaCl 0,9% 100 mL\nCmax 40mg/mL","Gravité 30 min",null,"non","Il est recommandé de perfuser la Ceftriaxone à distance et sur une voie séparée du calcium","Voies IM et IVD lente possibles en l'absence d'autres alternatives\nVoie SC non conforme (ANSM 23/10/2019)\nNéanmoins dans certaines situations, le clinicien peut juger indispensable l’administration de la ceftriaxone par voie sous-cutanée au regard du rapport bénéfice/risque pour son patient et sous réserve d’en informer ce dernier ou sa famille. (ANSM Novembre 2019)","RCP\nDISPO\nPOSO\nCTX1\nANSM (courrier 23/10/2019)"]
["Ertapénème","Prescription Hospitalière\nRétrocédable ","EPPI\n1g  dans 10 mL","1g toutes les 24h en perfusion de 30 min\n(Pour les souches dont la CMI est égale à 0,5 mg/L, une posologie journalière de 1 g × 2 peut se discuter)","IV","NaCl 0.9% 100 mL\nCmax 20mg/mL","Gravité 30 min",null,"non",null,null,"RCP\nDISPO\nPOSO\nIDNow"]
["Gentamicine","Disponible en ville","Ampoule prête à l'emploi","6 à 7 mg/kg/jour en perfusion de 30 min en dose unique journalière","IV","NaCl 0.9%\nCmax 10 mg/mL","Gravité 30 min",null,"non","Ne doit pas être mélangé avec d'autres médicaments.\nSurveillance : Dosage pic plasmatique si besoin et concentrations résiduelles si durée > 5 jours ou IR ","Voie IM ","RCP\nDISPO\nPOSO\nIDNow"]
["Imipénème + cilastine","Prescription Hospitalière\nDisponible en ville","NaCl 0,9%\nModalités : Ajouter environ 10 mL de la solution pour perfusion appropriée dans le flacon. Répéter la procédure avec 10 mL supplémentaires et transférer dans la solution pour perfusion. Agiter.","Posologie standard :\n0,5g toutes les 6h\n1g toutes les 8h\n                                                                                     \nForte posologie :\n1g toutes les 6h","IV","NaCl 0,9%  100 mL\nCmax 5 mg/mL","Dose ≤ 500mg : Gravité 20-30 min \nDose > 500mg : Gravité 40-60 min",null,"non","La solution reconstituée ne doit pas être utilisée directement pour la perfusion\nLa perfusion continue n'est pas recommandée (problème de stabilité)\nLa vitesse de perfusion peut être ralentie en cas de nausées pendant la perfusion ou de posologies élevées",null,"RCP\nDISPO\nPOSO"]
["Méropénème","Prescription Hospitalière\nDisponible en ville","EPPI\nVolume de solvant selon la dose : \n- 500 mg : 10 mL\n- 1 g : 20 mL\n- 2 g : 40 mL","Posologie standard :\n1g toutes les 8h en perfusion de 30 min\n                                                                                     \nForte posologie :\n2g toutes les 8h en perfusion de 3h à 8h","IV","Gravité : NaCl 0,9%\n- 1 g : 100 mL\n- 2 g : 250 mL\nCmax 20 mg/mL\n\nPSE : NaCl 0,9% (Cmax 41,7 mg/mL soit 2 g dans 48 mL)","1 gx3/j : Gravité 30 min\n2gx3/j : PSE sur 3h à 8h",null,"objectifs d'efficacité PK/PD","La posologie de 2 g toutes les 8 h en perfusions de 30 min ne permet pas d’atteindre les objectifs d’efficacité PK/PD pour les souches catégorisées « SFP »","Voie IVD lente","RCP\nDISPO\nStabilis\nPOSO\nIDNow"]
["Oxacilline","Disponible en ville","EPPI :\n- 1 g : 5 mL","Administration discontinue :\n100 à 200 mg/kg/jour toutes les 4h en perfusion de 30 à 60 min\n\nAdministration continue : \n100 à 200 mg/kg/jour après dose de charge de 2 g sur 60 min","IV","Gravité : NaCl 0,9% 100mL (Cmax 100mg/mL)\nDiffuseur : NaCl 0,9% (Cmax 50 mg/mL)","Perfusion continue :\nDiffuseur sur 8h (respecter la Cmax)","Administration discontinue :\nGravité 30 à 60 min","non",null,"Voie IVD lente","RCP\nDISPO\nPOSO\nOXA"]
["Pipéracilline-tazobactam","Prescription Hospitalière\nDisponible en ville","EPPI\n2g: 10 mL\n4g: 20 mL","Posologie standard :\nAdministration discontinue : \n4g/0,5g toutes les 6h en perfusion de 30 min\n\nAdministration continue : \n8 g/jour après dose de charge de [4 g pipéracilline + 0,5 g tazobactam] en perfusion de 30 min\n                                                                                     \nForte posologie :\nAdministration continue :\n≥ 12 g/jour après dose de charge de [4 g pipéracilline + 0,5 g tazobactam] en perfusion de 30 min","IV","Gravité NaCl 0,9% 100 mL (Cmax 125mg/mL)\nDiffuseur : G5% (Cmax 66,7 mg/mL)","En cas d'administration discontinue :\nGravité 30 min\nEn cas de perfusion continue :\nDiffuseur sur 24h (respecter la Cmax)",null,"non",null,null,"RCP\nDISPO\nPOSO\nSTAB"]
["Teicoplanine ","Prescription Hospitalière\nRétrocédable ","EPPI\n100mg dans 1,7 mL\n200 et 400mg dans 3,14 mL","Dose de charge : 12mg/kg toutes les 12h en 3 à 5 injections\nDose d'entretien : 12mg/kg/j, toutes les 24h","IV","NaCl 0,9% 100mL (Cmax : 40 mg/mL)","Gravité 30 min",null,"non","Stable 24h à 25°C\nAgiter doucement pour éviter la formation de mousse.\nSi apparition de mousse lors de la reconstitution, laisser reposer jusqu'à disparition\nSurveillance : dosage des taux résiduels, plaquettes en cas de thrombopénie préexistante ou de traitement prolongé","Voies IM et IVD lente ","RCP\nDISPO\nPOSO\nHUG\nIDNow"]
["Témocilline","Prescription Hospitalière\nRétrocédable","EPPI\n1g dans 10 mL\n2 g dans 20 mL","Administration discontinue :\n2g toutes les 8h en perfusion de 30 min\n\nAdministration continue : \n≥ 6 g/jour après dose de charge de 2 g en perfusion de 30 min","IV","Gravité : NaCl 0,9% 100 mL (Cmax 125mg/mL)\nDiffuseur : NaCl 0,9% (Cmax 25 mg/mL)","Perfusion continue : \nDiffuseur sur 24 h (respecter Cmax) \nAdministration discontinue : \nGravité 30 min",null,"non","Le produit doit toujours être utilisé immédiatement après la reconstitution et la dilution.\nLa posologie de 2 g toutes les 12 h en perfusions de 30 min a été utilisée avec succès dans des études rétrospectives portant sur des infections urinaires.","Voies IM et IVD lente ","RCP \nDISPO\nPOSO\nSTAB"]
["Tobramycine","Disponible en ville","ampoule prête à l'emploi","6 à 7 mg/kg/j  en perfusion de 30 min en dose unique journalière","IV","NaCl 0.9% 100mL","Gravité 30 min",null,"non","Ne doit pas être mélangé avec d'autres médicaments\nutilisation immédiate après reconstitution\nSurveillance : Dosage pic plasmatique si besoin et concentrations résiduelles si durée > 5 jours ou IR ",null,"RCP\nDISPO\nPOSO\nAN1"]
["Vancomycine","Prescription Hospitalière\nRétrocédable ","EPPI\n500 mg dans 10 mL \n1g dans 20 mL\n\n","Administration discontinue : \nDose de charge : 20 à 30 mg/kg en 1h à 2h\nDose d'entretien : 20 à 40 mg/kg/j en perfusion de 1h, toutes les 12h à 6h\n\nAdministration continue \nDose de charge : 20 à 30 mg/kg en 1h à 2h\nDose d'entretien : 20 à 40mg/kg/j","IV","NE PAS ADMINISTRER SANS DILUTION\nNaCl 0,9% \nVVP avec gravité : Cmax 5 mg/mL jusqu'à 10 mg/mL si restriction hydrique\nVVC avec diffuseur : Cmax 37,5 mg/mL pour une stabilité jusqu'à 37°C sur 24h","Perfusion continue sur voie veineuse centrale :\nDiffuseur sur 24h (respecter Cmax)","Administration discontinue sur voie veineuse périphérique :\nGravité 60 min","non","Pas de perfusion continue sur voie veineuse périphérique à domicile\nNe pas mélanger avec d'autres médicaments. \nNe pas administrer sans dilution. \nSurveillance : dosage des taux résiduels, dosage de la créatinine sérique, NFS\nPas d'IVD, pas d'IM",null,"RCP\nDISPO\nPOSO\nSTAB\nIDNow"]
["IMMUNOGLOBULINES POLYVALENTES IV"]
["Immunoglobulines Polyvalentes IV ","Prescription Hospitalière\nRétrocédable ","EPPI ou prêtes à l'emploi\n--> Consulter les fiches dédiées "," --> Consulter les fiches dédiées (Gammagard, Tegeline, Privigen, Octagam, …)","IV","Si besoin diluer dans solution de Glucose 5% si concentration souhaitée à 50 mg/mL (5 %)","Pompe",null,"nécessité précision du débit ≥ 95% sécurisée","Lors de la première injection le débit doit être lent. Il pourra être augmenté par la suite selon la tolérance du patient et les RCP des différentes immunoglobulines\n --> Consulter les fiches dédiées \nLa solution doit être controlée et sans particule\nLe produit doit être amené à température ambiante (25°C) avant l'utilisation",null,"RCP\nIgIV1 \nIgIV2\nIgIV3"]
["IMMUNOGLOBULINES POLYVALENTES SC"]
["Immunoglobulines Polyvalentes SC","Prescription Hospitalière\nRétrocédable "," Prêtes à l'emploi"," --> Consulter les fiches dédiées (Gammanorm, Hizentra, …)","SC",null,"Pompe ou PSE",null,"nécessité précision du débit ≥ 95% sécurisée","Lors de la première injection le débit doit être lent. Il pourra être augmenté par la suite selon la tolérance du patient et les RCP des différentes immunoglobulines\n --> Consulter les fiches dédiées \nLe médicament doit être amené à température ambiante ou du corps avant utilisation.\n","Pour GAMMANORM : IM possible","RCP\nIgSC1 \nIgSC2"]
["CLASSE ATC SYSTÈME NERVEUX"]
["Apomorphine","Disponible en ville","Ampoule prête à l'emploi","Perfusion initiale à 1mg/h puis\nPerfusion d'entretien selon la réponse individuelle de 1 mg/h à 7 mg/h (4mg/h avec DOPACEPTIN) \nAugmentation par paliers de 0,5 mg/heure maxi avec des intervalles d'au moins 4 heures\nRecommandation : ne pas dépasser une dose totale d'apomorphine de 100 mg/j","Perfusion continue SC ± bolus intermittents","Pas de modalités de dilution","Pompe ou PSE",null,"nécessité précision du débit ≥ 95% sécurisée","Perfusion continue durant les périodes d'éveil,\nRespecter une période nocturne sans traitement d'au moins 4 heures\n24h/24h déconseillé (sauf cas particuliers)\n\nChanger de site de perfusion toutes les 12 heures\nNe pas utiliser la voie IV",null,"RCP"]
["Midazolam","Assimilé stupéfiant : ordonnance sécurisée, de 28 jours maximum avec délivrance fractionnée de 7j sauf mention expresse du prescripteur « délivrance en une seule fois »\nDisponible en ville dans les 2 indications de sédation ","Ampoule prête à l'emploi","Sédation vigile\nSédation en soins palliatifs chez l'adulte (proportionnée ou profonde et continue)","IV",null,"Administration en bolus :\nIVD lente\nAdministration en continu : \nPSE",null,"nécessité précision du débit ≥ 95% sécurisée",null,"Administrations IM, SC et rectale possibles","RCP\nMI1  "]
["Morphine","Disponible en ville\nStupéfiant ","Utiliser des ampoules de même concentration.\nPrêt à l'emploi, concentrations disponibles : 1 ; 10 ; 20 ; 100 mg/mL","Selon protocole (bolus + perfusion continue)\nBolus IV  : 1 à 3 mg espacés de 4 à 6 heures.\nRelais en perfusion SC continue (0,5 mg/kg/jour) ou IV continue (0,3 mg/kg/jour)\nPas de dose maxi tant que les effets secondaires sont contrôlés","Perfusion continue (PCA) IV ou SC","Ne pas diluer si possible, sinon NaCl 0,9%\nConcentration qui doit être compatible avec le débit minimal ou la dose minimale du bolus demandé","Pompe PCA ",null,"nécessité précision du débit ≥ 95% sécurisée","Le raccordement de la tubulure PCA doit être placé au plus près possible du point d'injection. \nToute connexion supplémentaire doit être montée en amont d'une valve anti-retour et placée en Y de la ligne de perfusion PCA\nLe débit continu en mg/j (débit de perfusion) doit être arrondi, XY mg/24h en nombre entier multiple de 12 en fonction de la durée de la prescription (pour éviter les calculs)\nL’utilisation d’un pousse seringue électrique (PSE) à la place d’une pompe PCA n'est pas recommandée à domicile (système non sécurisé)",null,"RCP\nMO1\nMO2\nMO3 \nMO4"]
["Néfopam","Prescription non renouvelable\nDisponible en ville","Ampoule prête à l'emploi","20mg toutes les 4h (max 120mg/j)","IV","Si perfusion : Nacl 0,9% 100 mL","Gravité 15 à 30 min","Diffuseur","non","Absence de donnée de stabilité publiée mais une pratique clinique en faveur du diffuseur. Etudes de stabilité en cours","Autres voies : IM profonde toutes les 6h\nVoie sublinguale en pratique (hors AMM)","RCP  \nTheriaque\nStabilis"]
["Oxycodone","Rétrocedable uniquement dans le cadre des douleurs chroniques et soins palliatifs ","Utiliser des ampoules de même concentration.\n\nPrêt à l'emploi, concentrations disponibles : 1 ; 10 ; 50 mg/mL","Selon protocole (bolus + perfusion continue)\nBolus :\n- IV de 1 à 10mg\n- SC 5mg\nPerfusion, dosage initial :\nIV et SC : 0,125mg/kg/jour\nDoses patient dépendant","IV\nSC","Ne pas diluer si possible, sinon NaCl 0,9%\nConcentration qui doit être compatible avec le débit minimal ou la dose minimale du bolus demandé","Pompe PCA",null,"nécessité précision du débit ≥ 95% sécurisée","Le raccordement de la tubulure PCA doit être placé au plus près possible du point d'injection. \nToute connexion supplémentaire doit être montée en amont d'une valve anti-retour et placée en Y de la ligne de perfusion PCA\nPoches prêtes à l'emploi 100 mL avec 2 concentrations différentes (1mg/mL et 10mg/mL)\nL’utilisation d’un pousse seringue électrique (PSE) à la place d’une pompe PCA n'est pas recommandée à domicile (système non sécurisé)\n\nConcentration préférentielle pour perfusion :\n1mg/ml pour IV,\n10mg/mL pour SC",null,"RCP\nOXY1\nMO4"]
["Ropivacaïne","Prescription Hospitalière \nRétrocedable","Poche prête à l'emploi concentration 2mg/mL","10-20 mg/h en continu","Périnerveux","Pas de dilution","Pompe PCA ou Diffuseur",null,"nécessité précision du débit ≥ 95% sécurisée","Bloc périphérique nerveux (analgésie  post-opératoire)\nL’analgésie post-opératoire par cathéter péri-nerveux en ambulatoire nécessite une surveillance à domicile pendant la période du cathéterisme périnerveux (48 à 72 heures) : surveillance infirmière quotidienne et présence d’un proche au domicile en fin de journée ou à défaut surveillance biquotidienne de l’infirmier(e).                                           ","Dans le cadre des soins palliatifs à domicile (hors AMM) la Ropivacaïne peut être injectée par voie périmédullaire","RCP\nROP1\nROP2"]
["CLASSE ATC ANTINEOPLASIQUE ET IMMUNOMODULATEURS"]
["5 FU","Prescription Hospitalière \nRétrocedable","La préparation doit être réalisée en PUI, se référer aux protocoles locaux","Selon protocole de l'établissement autorisé en cancérologie","IV","La préparation doit être réalisée en PUI, se référer aux protocoles locaux","Diffuseur\r",null,null,"Ne doit pas etre mélangé avec d'autres médicaments. \nIncompatibilité avec le levofolinate de calcium et les solutions de morphine",null,"RCP\nStabilis\r\nBPPH\r\n5FU1\n5FU2"]
["CLASSE ATC SANG ET ORGANE HEMATOPOETIQUE"]
["Chlorure de sodium","Disponible en ville","Prêt à l'emploi","La posologie usuelle doit être adaptée aux besoins du patient en fonction de l'état clinique, du poids et des résultats des examens ioniques sanguins et urinaires","IV\nSC (à privilégier en gériatrie, en soins palliatifs et pour les patients au capital veineux altéré)",null,"IV : Gravité\nSC : Gravité\n1500mL à 2000mL /24h/site injection\nou\n1000mL/8h la nuit\nou\n500mL/2h",null,"non","La posologie, le débit et la durée d’administration doivent être déterminés en fonction de plusieurs facteurs comprenant l'âge, le poids, l'état clinique, les pathologies cardiaques, le traitement concomitant et en particulier l'état d'hydratation du patient, des besoins en ions sodium et chlorure, la réponse clinique et biologique au traitement","Voie IM ","RCP\nNaCl1\nNaCl2 "]
["Héparine sodique","Disponible en ville","Ampoule et flacon prêts à emploi","En traitement curatif en prévention des accidents thromboemboliques en cas de cardiopathie emboligène:\n- Hors coagulopathie :\n1/ bolus : 50UI/kg\n2/ dose initiale 20UI/kg/heure puis à adapter\n- Coagulopathie : dose inférieure (risque hémorragique)","IV","En fonction des protocoles\n\nLa dose journalière doit être répartie dans au moins 2 seringues par jour","Administration en bolus :\nIVD lente\nPosologie initiale et entretien : \nPSE",null,"non","Ne doit pas être mélangé avec d'autres médicaments\nConservation à température ambiante, \nAprès ouverture le produit doit être utilisé immédiatement \nSurveillance biologique quotidienne ( TCA ou activité anti-Xa), plaquettes\nRelais par anticoagulants oraux chaque fois que cela est possible\nNe pas injecter par voie IM",null,"RCP"]
["Hydrate de carbone (soluté glucosé) polyionique prêts à l'emploi","Disponible en ville","Glucose 2,5% ou 5 % AVEC CHLORURE DE SODIUM","La posologie usuelle doit être adaptée aux besoins du patient en fonction de l'état clinique, du poids et des résultats des examens ioniques sanguins et urinaires","IV\nSC (à privilégier en gériatrie, en soins palliatifs et pour les patients au capital veineux altéré)",null,"IV : Gravité\nSC : Gravité\n1500mL à 2000mL /24h/site injection\nou\n1000mL/8h la nuit\nou\n500mL/2h",null,"non","L'équilibre hydrique, la glycémie, la natrémie et d'autres électrolytes pourront faire l'objet d'une surveillance avant ou pendant l'administration",null,"RCP\nNaCl1\nNaCl2"]
["Hydrate de carbone (soluté glucosé) polyionique prêts à l'emploi","Disponible en ville","Utiliser des solutés isotoniques polyioniques prêts à l'emploi\nBIONOLYTE G5\nPOLYIONIQUE 1A G5 BXT VFO","La posologie usuelle doit être adaptée aux besoins du patient en fonction de l'état clinique, du poids et des résultats des examens ioniques sanguins et urinaires","IV",null,"IV : Gravité\n1500mL à 2000mL /24h/site injection\nou\n1000mL/8h la nuit\nou\n500mL/2h",null,"non","L'équilibre hydrique, la glycémie, la natrémie et d'autres électrolytes pourront faire l'objet d'une surveillance avant ou pendant l'administration\nL'administration de potassium en SC est à éviter à cause du risque de nécrose cutanée",null,"RCP \nNaCl1\nNaCl2"]
["CLASSE ATC MUSCLE ET SQUELETTE"]
["Acide Zolédronique","Disponible en ville","EPPI 5 mL ou prêt à l'emploi (en fonction des présentations et des génériques) ","En fonction de l'indication et de la présentation ","IV","4 ou 5 mg / 100 mL : pas de dilution\n4 ou 5 mg / 5 mL : 100 mL NaCl 0,9%\n\nDilution pour les insuffisants rénaux (cf commentaires)","Gravité 15-30 min",null,"non","Dose si IR: 3,5, 3,3 mg ou 3 mg.\nDilution  de l'acide zolédronique 4 mg/100 mL :\n - 3,5 mg : Retirer 12 mL et remplacer par 12 mL de NaCl 0,9%\n - 3,3 mg : Retirer 18 mL et remplacer par 18 mL de NaCl 0,9%\n - 3 mg : Retirer 25 mL et remplacer par 25 mL de NaCl 0,9%\n\nNe doit pas être mélangé avec des solutions contenant du calcium",null,"RCP"]
["CLASSE ATC HORMONES SYSTEMIQUES"]
["Bétaméthasone\n4mg/1mL","Disponible en ville","Prêt à l'emploi","1 à 5 ampoules/administration à adapter en fonction de l'indication (la dose peut éventuellement être augmentée en fonction de la situation clinique du patient)","IV","NaCl 0,9% 100 mL","Gravité 15-30 min",null,"non",null,"Voie IVD \nVoie IM","RCP\nBE1\n"]
["Méthylprednisolone","Disponible en ville","EPPI\n20mg /40mg /120mg dans 2 mL\n1g dans 15,6 mL","Selon indication","IV","si perfusion dans NaCl 0.9 %","Gravité 20-30 min",null,"non","incompatibilités: allopurinol sodium, chlorhydrate de doxapram, tigécycline, chlorhydrate de diltiazem, gluconate de calcium, bromure de rocuronium, bésilate de cisatracurium, glycopyrrolate, propofol","IM profonde possible pour dosage à 20mg\nIVD lente minimum 20-30 min","RCP \nStabilis"]

{"sheet":"Références bibliographiques","index":12,"n_rows":38,"n_cols":11,"rows_kept":38,"cut":false,"hidden":false,"merged":[]}
["RCP","https://base-donnees-publique.medicaments.gouv.fr/index.php#result"]
["DISPO","https://www.omedit-centre.fr/medias/Prescription-sortie-anti-infectieux-administration-intraveineuse-domicile_Procurer.pdf"]
["Stabilis","https://www.stabilis.org/ "]
["POSO","Posologie standard et forte posologie : propositions du groupe de travail SPLIF, SFPT & CA-SFM"]
["STAB","Loeuille G, D'Huart E, Vigneron J, Nisse YE, Beiler B, Polo C, Ayari G, Sacrez M, Demoré B, Charmillon A; Stability studies of 16 Antibiotics for Continuous Infusion in Intensive Care Units and for Performing Outpatient Parenteral Antimicrobial Therapy;  Antibiotics ;11,4: 458 2022 "]
["AN1","Recommandations ESC 2015 :  http://www.marfan.fr/wp-content/uploads/2015/11/eurheartj.ehv319.full_.pdf"]
["IDNow","Clément Ourghanlian et al. Intravenous administration of antibiotics by prolonged and continuous infusion, Infectious Diseases Now, 2024, 105018"]
["AMX1","https://ansm.sante.fr/actualites/rappel-du-bon-usage-de-lamoxicilline-injectable-pour-diminuer-le-risque-de-cristalluries"]
["AMX2","I. Boutouha, E. d'Huart, F. Blaise, N. Sobalak, C. Marquet, A. Charmillon, et al. Etude de la stabilité physicochimique de l'amoxicilline en diffuseur élastomérique en silicone à 32°C. Med Mal Infect Formation, 3 (2) (2024), pp. S151-S152"]
["AMB1","http://ageps.aphp.fr/wp-content/blogs.dir/68/files/2019/01/Recommandations-sur-le-bon-usage-des-antifongiques-dec-2018.pdf"]
["AMB2","Owens LC, Fleming RA, Restino MS, Cruz JM, Hurd DD; Stability of amphotericin B 0.05 and 0.5 mg/ml in 20% fat emulsion; Am J Health-Syst Pharm ; 54: 683-686. 1997"]
["AMB3","Kintzel PE, Kennedy PE ; Stability of amphotericin B in 5% dextrose injection at concentrations used for administration through a central venous line; Am J Hosp Pharm ; 48: 283-285. 1991"]
["FOX1","I. Boutouha, E. d'Huart, F. Blaise, N. Sobalak, C. Marquet, A. Charmillon, et al. Etude de la stabilité physicochimique de la céfoxitine en diffuseur élastomérique à 32°C. Mal Infect Formation, 3 (2) (2024), p. S152"]
["CTX1","https://ansm.sante.fr/informations-de-securite/ceftriaxone-rocephine-r-et-generiques-rappel-sur-les-voies-dadministration"]
["OXA","Thèse F.Z. Madouni; Etude de stabilité physico-chimique de solutions injectables d’oxacilline sodique : plans d’expériences et validation statistique des résultats; Université claude bernard - lyon 1; 2015"]
["IgIV1","https://www.omedit-normandie.fr/media-files/41313/interactif-brochure-infirmiere-2023-2024.pdf"]
["IgIV2","http://www.omedit-idf.fr/wp-content/uploads/2017/03/APHP_Brochure16pages_Immunoglobulines_bdef.pdf"]
["IgIV3","http://www.omedit-idf.fr/medicaments-princeps/igiv-immunoglobuline-humaine-normale-intraveineuse/",null,null,null,null,null,null,null,null,"Cliquer sur recommandations en bas de page (fiches juste prescription)"]
["IgSC1","https://sfpc.eu/wp-content/uploads/2022/03/Brochure-MDS-2022-Edition-16.pdf"]
["IgSC2","http://www.omedit-idf.fr/medicaments-princeps/igsc-immunoglobuline-humaine-normale-sous-cutanee/",null,null,null,null,null,null,null,null,"Cliquer sur recommandations en bas de page (fiches juste prescription)"]
["MI1","Recommandations HAS : Antalgie des douleurs rebelles et pratiques sédatives chez l’adulte : prise en charge médicamenteuse en situations palliatives jusqu’en fin de vie janvier 2020"]
["MO1","https://www.omedit-centre.fr/medias/B-A-BA_PCA.pdf"]
["MO2","https://www.omedit-centre.fr/medias/Morphiniques-injectables-douleur-aigue-post-operatoire_Adulte.pdf"]
["MO3","https://www.omedit-centre.fr/PCA/co/PCA_web.html"]
["MO4","http://www.sfap.org/rubrique/pca"]
["Theriaque","https://www.theriaque.org/apps/contenu/accueil.php"]
["OXY1","Lettre ANSM mise à disposition et informations importantes sur le bon usage - 17/07/2019 - OXYCODONE (chlorhydrate) RENAUDIN 1 mg/ml et 10 mg/ml, solutions pour perfusion déjà diluées en poches PP "]
["ROP1","https://www.afsos.org/wp-content/uploads/2016/09/2014_12_12_J2R_analgesie_IT_VF.pdf "]
["ROP2","https://ansm.sante.fr/uploads/2021/03/11/e987e318a5ee00d2f41ff6ef63c1969a.pdf"]
["BPPH","Arrêté du 22 juin 2001 relatif aux bonnes pratiques de pharmacie hospitalière - Légifrance (legifrance.gouv.fr)"]
["5FU1","Arrêté du 20/12/2004 fixant les conditions d'utilisation des anticancéreux injectables inscrits sur la liste des médicaments autorisés à être vendus au public par les pharmacies à usage intérieur des établissements de santé (JO du 23/12/2004)."]
["5FU2","Utilisation des diffuseurs portables de chimiothérapie anticancéreuse"]
["NaCl1","https://www.omedit-centre.fr/medias/Perfusion-sous-cutanee-hypodermoclyse.pdf"]
["NaCl2","HAS 2018 : Bon usage des solutions pour perfusion de glucose à 5%"]
["BE1","Gray.A et al. Injectable Drugs Guide. Pharmaceutical Press.2011"]
[]
["Et le document \"Perfusion à Domicile\" de l'Assurance Maladie "]
["https://www.ameli.fr/fileadmin/user_upload/documents/fiche_technique_perfusion_a_domicile_.pdf "]

{"sheet":"Listes","index":13,"n_rows":50,"n_cols":4,"rows_kept":50,"cut":false,"hidden":true,"merged":[]}
[null,"finess_geo","finess_juridique","Catégories"]
["FONDATION HOPITAL SAINT JOSEPH",750150120,750150120,"ESPIC"]
["GH PARIS SITE SAINT JOSEPH",750000523,750150120,"ESPIC"]
["HU EST PARISIEN SITE ST ANTOINE APHP",750100091,750712184,"Public"]
["HU EST PARISIEN SITE TENON APHP",750100273,750712184,"Public"]
["HU EST PARISIEN SITE TROUSSEAU APHP",750100109,750712184,"Public"]
["HU HENRI MONDOR SITE HENRI MONDOR APHP",940100027,750712184,"Public"]
["HU NECKER ENFANTS MALADES APHP",750100208,750712184,"Public"]
["HU OUEST SITE AMBROISE PARE APHP",920100013,750712184,"Public"]
["HU PARIS CENTRE SITE COCHIN APHP",750100166,750712184,"Public"]
["HU PARIS NORD SITE BEAUJON APHP",920100039,750712184,"Public"]
["HU PARIS NORD SITE BICHAT APHP",750100232,750712184,"Public"]
["HU PARIS NORD SITE LOUIS MOURIER APHP",920100047,750712184,"Public"]
["HU PARIS OUEST SITE G POMPIDOU APHP",750803447,750712184,"Public"]
["HU PARIS SITE AVICENNE APHP",930100037,750712184,"Public"]
["HU PARIS SUD SITE ANTOINE BECLERE APHP",920100021,750712184,"Public"]
["HU PARIS SUD SITE KREMLIN BICETRE APHP",940100043,750712184,"Public"]
["HU PITIE SALPETRIERE APHP",750100125,750712184,"Public"]
["HU SAINT LOUIS SITE LARIBOISIERE APHP",750100042,750712184,"Public"]
["HU SAINT LOUIS SITE SAINT LOUIS APHP",750100075,750712184,"Public"]
["INSTITUT MUTUALISTE MONTSOURIS",750150104,750720476,"ESPIC"]
["CHI POISSY ST GERMAIN SITE DE POISSY",780000311,780001236,"Public"]
["CH FRANCOIS QUESNAY MANTES",780000287,780110011,"Public"]
["CH DE VERSAILLES SITE ANDRE MIGNOT",780800256,780110078,"Public"]
["CH SUD FRANCILIEN",910002773,910002773,"Public"]
["CH SUD FRANCILIEN SITE JEAN JAURES",910020254,910002773,"Public"]
["CH DES DEUX VALLEES SITE LONGJUMEAU",910000298,910110055,"Public"]
["GROUPE HOSPITALIER NORD ESSONNE",910110055,910110055,"Public"]
["HOPITAL FOCH",920000650,920150059,"ESPIC"]
["GHI LE RAINCY MONTFERMEIL",930000286,930021480,"Public"]
["GPE HOSP INTERC DU RAINCY MONTFERMEIL",930021480,930021480,"Public"]
["CHI ANDRE GREGOIRE",930000302,930110036,"Public"]
["CHIC ANDRE GREGOIRE",930110036,930110036,"Public"]
["CH ROBERT BALLANGER",930110069,930110069,"Public"]
["CHI ROBERT BALLANGER",930000336,930110069,"Public"]
["CHI DE CRETEIL",940000573,940110018,"Public"]
["CHIC DE CRETEIL",940110018,940110018,"Public"]
["CHI LUCIE ET RAYMOND AUBRAC",940000599,940110042,"Public"]
["CHIC DE VILLENEUVE SAINT GEORGES",940110042,940110042,"Public"]
["ASSOCIATION HOPITAL SAINT CAMILLE",940150014,940150014,"ESPIC"]
["HOPITAL SAINT CAMILLE",940000649,940150014,"ESPIC"]
["CLCC INSTITUT GUSTAVE ROUSSY",940000664,940160013,"ESPIC"]
["CLCC INSTITUT GUSTAVE ROUSSY",940160013,940160013,"ESPIC"]
["GHEM SIMONE VEIL SITE EAUBONNE",950000323,950013870,"Public"]
["HOPITAL SIMONE VEIL (GHEM)",950013870,950013870,"Public"]
["CH VICTOR DUPOUY",950000307,950110015,"Public"]
["CH VICTOR DUPOUY",950110015,950110015,"Public"]
["CH GENERAL DE GONESSE",950000331,950110049,"Public"]
["CH GONESSE",950110049,950110049,"Public"]
["CH RENE DUBOS",950000364,950110080,"Public"]

{"sheet":"Référentiel_pour_Sphinx","index":14,"n_rows":235,"n_cols":21,"rows_kept":235,"cut":false,"hidden":true,"merged":[]}
["DCI","Dose",{"$f":"_xlfn.CONCAT(A1,B1)","v":"DCIDose"},"DCIDoseAdm","Administration","Classe ATC","Preconisations","Preco_IVD","Preco_Gravite","Preco_Diffuseur","Preco_SAE","Alt_IVD","Alt_Gravité","Alt_Diffuseur","Alt_SAE","Conformite_IVD","Conformite_Gravite","Conformite_Diff","Conformite_SAE","Conformite_SC_V4","Conformite_IV_V4"]
["5 FU","Toutes doses","5 FUToutes doses","5 FUToutes doses_Continue","Continue","Antinéoplasiques et immunomodulateurs","Diffuseur","Diffuseur","Diffuseur","Diffuseur","Diffuseur",null,"Pas de modalité alternative","Pas de modalité alternative","Pas de modalité alternative",null,"Non Conformité du mode d'administration / Divergence dans la prescription","Conformité du mode d'administration","Non Conformité du mode d'administration"]
["5 FU","Dose non renseignée","5 FUDose non renseignée","5 FUDose non renseignée_Continue","Continue","Antinéoplasiques et immunomodulateurs","Diffuseur","Diffuseur","Diffuseur","Diffuseur","Diffuseur",null,"Pas de modalité alternative","Pas de modalité alternative","Pas de modalité alternative",null,"Non Conformité du mode d'administration / Divergence dans la prescription","Conformité du mode d'administration","Non Conformité du mode d'administration"]
["ACIDE ZOLEDRONIQUE","Toutes doses","ACIDE ZOLEDRONIQUEToutes doses","ACIDE ZOLEDRONIQUEToutes doses_Continue","Continue","Muscle et squelette","Gravité 15-30 min","Gravité 15-30 min","Gravité 15-30 min","Gravité 15-30 min","Gravité 15-30 min",null,"Pas de modalité alternative","Pas de modalité alternative","Pas de modalité alternative",null,"Conformité du mode d'administration / Divergence dans la prescription","Non Conformité du mode d'administration","Non Conformité du mode d'administration"]
["ACIDE ZOLEDRONIQUE","Dose non renseignée","ACIDE ZOLEDRONIQUEDose non renseignée","ACIDE ZOLEDRONIQUEDose non renseignée_Continue","Continue",null,"Gravité 15-30 min","Gravité 15-30 min","Gravité 15-30 min","Gravité 15-30 min","Gravité 15-30 min",null,"Pas de modalité alternative","Pas de modalité alternative","Pas de modalité alternative",null,"Conformité du mode d'administration / Divergence dans la prescription","Non Conformité du mode d'administration","Non Conformité du mode d'administration"]
["AMIKACINE","Toutes doses","AMIKACINEToutes doses","AMIKACINEToutes doses_Continue","Continue","Antiinfectieux généraux à usage systémique","Gravité 30 min","Gravité 30 min","Gravité 30 min","Gravité 30 min","Gravité 30 min",null,"Pas de modalité alternative","Pas de modalité alternative","Pas de modalité alternative",null,"Conformité du mode d'administration / Divergence dans la prescription","Non Conformité du mode d'administration","Non Conformité du mode d'administration"]
["AMIKACINE","Dose non renseignée","AMIKACINEDose non renseignée","AMIKACINEDose non renseignée_Continue","Continue","Antiinfectieux généraux à usage systémique","Gravité 30 min","Gravité 30 min","Gravité 30 min","Gravité 30 min","Gravité 30 min",null,"Pas de modalité alternative","Pas de modalité alternative","Pas de modalité alternative",null,"Conformité du mode d'administration / Divergence dans la prescription","Non Conformité du mode d'administration","Non Conformité du mode d'administration"]
["AMOXICILLINE","Toutes doses","AMOXICILLINEToutes doses","AMOXICILLINEToutes doses_Continue","Continue","Antiinfectieux généraux à usage systémique","Administration discontinue : Gravité 30 min\nPerfusion continue et en fonction de la mobilité du patient : Diffuseur sur 12H (respecter la Cmax)","Administration discontinue : Gravité 30 min\nPerfusion continue et en fonction de la mobilité du patient : Diffuseur sur 12H (respecter la Cmax)","Administration discontinue : Gravité 30 min\nPerfusion continue et en fonction de la mobilité du patient : Diffuseur sur 12H (respecter la Cmax)","Administration discontinue : Gravité 30 min\nPerfusion continue et en fonction de la mobilité du patient : Diffuseur sur 12H (respecter la Cmax)","Administration discontinue : Gravité 30 min\nPerfusion continue et en fonction de la mobilité du patient : Diffuseur sur 12H (respecter la Cmax)",null,"Pas de modalité alternative","Pas de modalité alternative","Pas de modalité alternative",null,"Conformité du mode d'administration / Divergence dans la prescription","Conformité du mode d'administration","Non Conformité du mode d'administration"]
["AMOXICILLINE","Dose non renseignée","AMOXICILLINEDose non renseignée","AMOXICILLINEDose non renseignée_Continue","Continue","Antiinfectieux généraux à usage systémique","Administration discontinue : Gravité 30 min\nPerfusion continue et en fonction de la mobilité du patient : Diffuseur sur 12H (respecter la Cmax)","Administration discontinue : Gravité 30 min\nPerfusion continue et en fonction de la mobilité du patient : Diffuseur sur 12H (respecter la Cmax)","Administration discontinue : Gravité 30 min\nPerfusion continue et en fonction de la mobilité du patient : Diffuseur sur 12H (respecter la Cmax)","Administration discontinue : Gravité 30 min\nPerfusion continue et en fonction de la mobilité du patient : Diffuseur sur 12H (respecter la Cmax)","Administration discontinue : Gravité 30 min\nPerfusion continue et en fonction de la mobilité du patient : Diffuseur sur 12H (respecter la Cmax)",null,"Pas de modalité alternative","Pas de modalité alternative","Pas de modalité alternative",null,"Conformité du mode d'administration / Divergence dans la prescription","Conformité du mode d'administration","Non Conformité du mode d'administration"]
["AMOXICILLINE ACIDE CLAVULANIQUE","Toutes doses","AMOXICILLINE ACIDE CLAVULANIQUEToutes doses","AMOXICILLINE ACIDE CLAVULANIQUEToutes doses_Continue","Continue","Antiinfectieux généraux à usage systémique","Gravité 30 min","Gravité 30 min","Gravité 30 min","Gravité 30 min","Gravité 30 min",null,"Pas de modalité alternative","Pas de modalité alternative","Pas de modalité alternative",null,"Conformité du mode d'administration / Divergence dans la prescription","Non Conformité du mode d'administration","Non Conformité du mode d'administration"]
["AMOXICILLINE ACIDE CLAVULANIQUE","Dose non renseignée","AMOXICILLINE ACIDE CLAVULANIQUEDose non renseignée","AMOXICILLINE ACIDE CLAVULANIQUEDose non renseignée_Continue","Continue","Antiinfectieux généraux à usage systémique","Gravité 30 min","Gravité 30 min","Gravité 30 min","Gravité 30 min","Gravité 30 min",null,"Pas de modalité alternative","Pas de modalité alternative","Pas de modalité alternative",null,"Conformité du mode d'administration / Divergence dans la prescription","Non Conformité du mode d'administration","Non Conformité du mode d'administration"]
["AMPHOTERICINE B FUNGIZONE","Toutes doses","AMPHOTERICINE B FUNGIZONEToutes doses","AMPHOTERICINE B FUNGIZONEToutes doses_Continue","Continue","Antiinfectieux généraux à usage systémique","Dose test : IV lente (20-30 minutes)\nPompe administration en 2 à 6h","Dose test : IV lente (20-30 minutes)\nPompe administration en 2 à 6h","Dose test : IV lente (20-30 minutes)\nPompe administration en 2 à 6h","Dose test : IV lente (20-30 minutes)\nPompe administration en 2 à 6h","Dose test : IV lente (20-30 minutes)\nPompe administration en 2 à 6h",null,"Pas d'autre modalité alternative","Gravité 2 à 6 heures si envisageable","Gravité 2 à 6 heures si envisageable",null,"Modalité alternative d'administration / Divergence dans la prescription","Non Conformité du mode d'administration","Conformité du mode d'administration"]
["AMPHOTERICINE B FUNGIZONE","Dose non renseignée","AMPHOTERICINE B FUNGIZONEDose non renseignée","AMPHOTERICINE B FUNGIZONEDose non renseignée_Continue","Continue","Antiinfectieux généraux à usage systémique","Dose test : IV lente (20-30 minutes)\nPompe administration en 2 à 6h","Dose test : IV lente (20-30 minutes)\nPompe administration en 2 à 6h","Dose test : IV lente (20-30 minutes)\nPompe administration en 2 à 6h","Dose test : IV lente (20-30 minutes)\nPompe administration en 2 à 6h","Dose test : IV lente (20-30 minutes)\nPompe administration en 2 à 6h",null,"Pas d'autre modalité alternative","Gravité 2 à 6 heures si envisageable","Gravité 2 à 6 heures si envisageable",null,"Modalité alternative d'administration / Divergence dans la prescription","Non Conformité du mode d'administration","Conformité du mode d'administration"]
["AMPHOTERICINE B LIPOSOMALE AMBISOME","Toutes doses","AMPHOTERICINE B LIPOSOMALE AMBISOMEToutes doses","AMPHOTERICINE B LIPOSOMALE AMBISOMEToutes doses_Continue","Continue","Antiinfectieux généraux à usage systémique","Gravité 30-60 min (prolonger la durée si perfusion mal tolérée)","Gravité 30-60 min (prolonger la durée si perfusion mal tolérée)","Gravité 30-60 min (prolonger la durée si perfusion mal tolérée)","Gravité 30-60 min (prolonger la durée si perfusion mal tolérée)","Gravité 30-60 min (prolonger la durée si perfusion mal tolérée)",null,"Pompe (si perfusion de 2 à 4 heures en cas de posologie supérieure à 3mg/kg/j)","Pompe (si perfusion de 2 à 4 heures en cas de posologie supérieure à 3mg/kg/j)","Pas d'autre modalité alternative",null,"Conformité du mode d'administration / Divergence dans la prescription","Non Conformité du mode d'administration","Modalité alternative d'administration"]
["AMPHOTERICINE B LIPOSOMALE AMBISOME","Dose non renseignée","AMPHOTERICINE B LIPOSOMALE AMBISOMEDose non renseignée","AMPHOTERICINE B LIPOSOMALE AMBISOMEDose non renseignée_Continue","Continue","Antiinfectieux généraux à usage systémique","Gravité 30-60 min (prolonger la durée si perfusion mal tolérée)","Gravité 30-60 min (prolonger la durée si perfusion mal tolérée)","Gravité 30-60 min (prolonger la durée si perfusion mal tolérée)","Gravité 30-60 min (prolonger la durée si perfusion mal tolérée)","Gravité 30-60 min (prolonger la durée si perfusion mal tolérée)",null,"Pompe (si perfusion de 2 à 4 heures en cas de posologie supérieure à 3mg/kg/j)","Pompe (si perfusion de 2 à 4 heures en cas de posologie supérieure à 3mg/kg/j)","Pas d'autre modalité alternative",null,"Conformité du mode d'administration / Divergence dans la prescription","Non Conformité du mode d'administration","Modalité alternative d'administration"]
["APOMORPHINE","Toutes doses","APOMORPHINEToutes doses","APOMORPHINEToutes doses_Continue","Continue","Système nerveux","Pompe ou PSE","Pompe ou PSE","Pompe ou PSE","Pompe ou PSE","Pompe ou PSE",null,"Pas de modalité alternative","Pas de modalité alternative","Pas de modalité alternative",null,"Non Conformité du mode d'administration / Divergence dans la prescription","Non Conformité du mode d'administration","Conformité du mode d'administration"]
["APOMORPHINE","Dose non renseignée","APOMORPHINEDose non renseignée","APOMORPHINEDose non renseignée_Continue","Continue","Système nerveux","Pompe ou PSE","Pompe ou PSE","Pompe ou PSE","Pompe ou PSE","Pompe ou PSE",null,"Pas de modalité alternative","Pas de modalité alternative","Pas de modalité alternative",null,"Non Conformité du mode d'administration / Divergence dans la prescription","Non Conformité du mode d'administration","Conformité du mode d'administration"]
["AZTREONAM","Toutes doses","AZTREONAMToutes doses","AZTREONAMToutes doses_Continue","Continue","Antiinfectieux généraux à usage systémique","Perfusion continue : Diffuseur sur 24h (respecter Cmax)\nAdministration discontinue : Gravité 30 min","Perfusion continue : Diffuseur sur 24h (respecter Cmax)\nAdministration discontinue : Gravité 30 min","Perfusion continue : Diffuseur sur 24h (respecter Cmax)\nAdministration discontinue : Gravité 30 min","Perfusion continue : Diffuseur sur 24h (respecter Cmax)\nAdministration discontinue : Gravité 30 min","Perfusion continue : Diffuseur sur 24h (respecter Cmax)\nAdministration discontinue : Gravité 30 min",null,"Pas de modalité alternative","Pas de modalité alternative","Pas de modalité alternative",null,"Conformité du mode d'administration / Divergence dans la prescription","Conformité du mode d'administration","Non Conformité du mode d'administration"]
["AZTREONAM","Dose non renseignée","AZTREONAMDose non renseignée","AZTREONAMDose non renseignée_Continue","Continue","Antiinfectieux généraux à usage systémique","Perfusion continue : Diffuseur sur 24h (respecter Cmax)\nAdministration discontinue : Gravité 30 min","Perfusion continue : Diffuseur sur 24h (respecter Cmax)\nAdministration discontinue : Gravité 30 min","Perfusion continue : Diffuseur sur 24h (respecter Cmax)\nAdministration discontinue : Gravité 30 min","Perfusion continue : Diffuseur sur 24h (respecter Cmax)\nAdministration discontinue : Gravité 30 min","Perfusion continue : Diffuseur sur 24h (respecter Cmax)\nAdministration discontinue : Gravité 30 min",null,"Pas de modalité alternative","Pas de modalité alternative","Pas de modalité alternative",null,"Conformité du mode d'administration / Divergence dans la prescription","Conformité du mode d'administration","Non Conformité du mode d'administration"]
["BETAMETHASONE","Toutes doses","BETAMETHASONEToutes doses","BETAMETHASONEToutes doses_Continue","Continue","Hormones systémiquess","Gravité 15-30 min","Gravité 15-30 min","Gravité 15-30 min","Gravité 15-30 min","Gravité 15-30 min",null,"Pas de modalité alternative","Pas de modalité alternative","Pas de modalité alternative",null,"Conformité du mode d'administration / Divergence dans la prescription","Non Conformité du mode d'administration","Non Conformité du mode d'administration"]
["BETAMETHASONE","Dose non renseignée","BETAMETHASONEDose non renseignée","BETAMETHASONEDose non renseignée_Continue","Continue","Hormones systémiquess","Gravité 15-30 min","Gravité 15-30 min","Gravité 15-30 min","Gravité 15-30 min","Gravité 15-30 min",null,"Pas de modalité alternative","Pas de modalité alternative","Pas de modalité alternative",null,"Conformité du mode d'administration / Divergence dans la prescription","Non Conformité du mode d'administration","Non Conformité du mode d'administration"]
["CASPOFUNGINE","Toutes doses","CASPOFUNGINEToutes doses","CASPOFUNGINEToutes doses_Continue","Continue","Antiinfectieux généraux à usage systémique","Gravité 60 min","Gravité 60 min","Gravité 60 min","Gravité 60 min","Gravité 60 min",null,"En cas de mobilité du patient :\n50mg : Diffuseur vol mini 100 mL 60 min\n70mg : Diffuseur vol mini 250 mL 60 min","Pas d'autre modalité alternative","En cas de mobilité du patient :\n50mg : Diffuseur vol mini 100 mL 60 min\n70mg : Diffuseur vol mini 250 mL 60 min",null,"Conformité du mode d'administration / Divergence dans la prescription","Modalité alternative d'administration","Non Conformité du mode d'administration"]
["CASPOFUNGINE","Dose non renseignée","CASPOFUNGINEDose non renseignée","CASPOFUNGINEDose non renseignée_Continue","Continue","Antiinfectieux généraux à usage systémique","Gravité 60 min","Gravité 60 min","Gravité 60 min","Gravité 60 min","Gravité 60 min",null,"En cas de mobilité du patient :\n50mg : Diffuseur vol mini 100 mL 60 min\n70mg : Diffuseur vol mini 250 mL 60 min","Pas d'autre modalité alternative","En cas de mobilité du patient :\n50mg : Diffuseur vol mini 100 mL 60 min\n70mg : Diffuseur vol mini 250 mL 60 min",null,"Conformité du mode d'administration / Divergence dans la prescription","Modalité alternative d'administration","Non Conformité du mode d'administration"]
["CEFEPIME","Toutes doses","CEFEPIMEToutes doses","CEFEPIMEToutes doses_Continue","Continue","Antiinfectieux généraux à usage systémique","Perfusion continue : Diffuseur sur 12h (respecter la Cmax)\nAdministration discontinue : Gravité 30 min","Perfusion continue : Diffuseur sur 12h (respecter la Cmax)\nAdministration discontinue : Gravité 30 min","Perfusion continue : Diffuseur sur 12h (respecter la Cmax)\nAdministration discontinue : Gravité 30 min","Perfusion continue : Diffuseur sur 12h (respecter la Cmax)\nAdministration discontinue : Gravité 30 min","Perfusion continue : Diffuseur sur 12h (respecter la Cmax)\nAdministration discontinue : Gravité 30 min",null,"Pas de modalité alternative","Pas de modalité alternative","Pas de modalité alternative",null,"Conformité du mode d'administration / Divergence dans la prescription","Conformité du mode d'administration","Non Conformité du mode d'administration"]
["CEFEPIME","Dose non renseignée","CEFEPIMEDose non renseignée","CEFEPIMEDose non renseignée_Continue","Continue","Antiinfectieux généraux à usage systémique","Perfusion continue : Diffuseur sur 12h (respecter la Cmax)\nAdministration discontinue : Gravité 30 min","Perfusion continue : Diffuseur sur 12h (respecter la Cmax)\nAdministration discontinue : Gravité 30 min","Perfusion continue : Diffuseur sur 12h (respecter la Cmax)\nAdministration discontinue : Gravité 30 min","Perfusion continue : Diffuseur sur 12h (respecter la Cmax)\nAdministration discontinue : Gravité 30 min","Perfusion continue : Diffuseur sur 12h (respecter la Cmax)\nAdministration discontinue : Gravité 30 min",null,"Pas de modalité alternative","Pas de modalité alternative","Pas de modalité alternative",null,"Conformité du mode d'administration / Divergence dans la prescription","Conformité du mode d'administration","Non Conformité du mode d'administration"]
["CEFOXITINE","Toutes doses","CEFOXITINEToutes doses","CEFOXITINEToutes doses_Continue","Continue","Antiinfectieux généraux à usage systémique","Perfusion continue : Diffuseur sur 12h (respecter la Cmax)","Perfusion continue : Diffuseur sur 12h (respecter la Cmax)","Perfusion continue : Diffuseur sur 12h (respecter la Cmax)","Perfusion continue : Diffuseur sur 12h (respecter la Cmax)","Perfusion continue : Diffuseur sur 12h (respecter la Cmax)",null,"Pas de modalité alternative","Pas de modalité alternative","Pas de modalité alternative",null,"Non Conformité du mode d'administration / Divergence dans la prescription","Conformité du mode d'administration","Non Conformité du mode d'administration"]
["CEFOXITINE","Dose non renseignée","CEFOXITINEDose non renseignée","CEFOXITINEDose non renseignée_Continue","Continue","Antiinfectieux généraux à usage systémique","Perfusion continue : Diffuseur sur 12h (respecter la Cmax)","Perfusion continue : Diffuseur sur 12h (respecter la Cmax)","Perfusion continue : Diffuseur sur 12h (respecter la Cmax)","Perfusion continue : Diffuseur sur 12h (respecter la Cmax)","Perfusion continue : Diffuseur sur 12h (respecter la Cmax)",null,"Pas de modalité alternative","Pas de modalité alternative","Pas de modalité alternative",null,"Non Conformité du mode d'administration / Divergence dans la prescription","Conformité du mode d'administration","Non Conformité du mode d'administration"]
["CEFTAZIDIME","Toutes doses","CEFTAZIDIMEToutes doses","CEFTAZIDIMEToutes doses_Continue","Continue","Antiinfectieux généraux à usage systémique","Perfusion continue : Diffuseur sur 12h (respecter Cmax)\nAdministration discontinue : Gravité 30 min","Perfusion continue : Diffuseur sur 12h (respecter Cmax)\nAdministration discontinue : Gravité 30 min","Perfusion continue : Diffuseur sur 12h (respecter Cmax)\nAdministration discontinue : Gravité 30 min","Perfusion continue : Diffuseur sur 12h (respecter Cmax)\nAdministration discontinue : Gravité 30 min","Perfusion continue : Diffuseur sur 12h (respecter Cmax)\nAdministration discontinue : Gravité 30 min",null,"Pas de modalité alternative","Pas de modalité alternative","Pas de modalité alternative",null,"Conformité du mode d'administration / Divergence dans la prescription","Conformité du mode d'administration","Non Conformité du mode d'administration"]
["CEFTAZIDIME","Dose non renseignée","CEFTAZIDIMEDose non renseignée","CEFTAZIDIMEDose non renseignée_Continue","Continue","Antiinfectieux généraux à usage systémique","Perfusion continue : Diffuseur sur 12h (respecter Cmax)\nAdministration discontinue : Gravité 30 min","Perfusion continue : Diffuseur sur 12h (respecter Cmax)\nAdministration discontinue : Gravité 30 min","Perfusion continue : Diffuseur sur 12h (respecter Cmax)\nAdministration discontinue : Gravité 30 min","Perfusion continue : Diffuseur sur 12h (respecter Cmax)\nAdministration discontinue : Gravité 30 min","Perfusion continue : Diffuseur sur 12h (respecter Cmax)\nAdministration discontinue : Gravité 30 min",null,"Pas de modalité alternative","Pas de modalité alternative","Pas de modalité alternative",null,"Conformité du mode d'administration / Divergence dans la prescription","Conformité du mode d'administration","Non Conformité du mode d'administration"]
["CEFTRIAXONE","Toutes doses","CEFTRIAXONEToutes doses","CEFTRIAXONEToutes doses_Continue","Continue","Antiinfectieux généraux à usage systémique","Gravité 30 minutes","Gravité 30 minutes","Gravité 30 minutes","Gravité 30 minutes","Gravité 30 minutes",null,"Pas de modalité alternative","Pas de modalité alternative","Pas de modalité alternative",null,"Conformité du mode d'administration / Divergence dans la prescription","Non Conformité du mode d'administration","Non Conformité du mode d'administration"]
["CEFTRIAXONE","Dose non renseignée","CEFTRIAXONEDose non renseignée","CEFTRIAXONEDose non renseignée_Continue","Continue","Antiinfectieux généraux à usage systémique","Gravité 30 minutes","Gravité 30 minutes","Gravité 30 minutes","Gravité 30 minutes","Gravité 30 minutes",null,"Pas de modalité alternative","Pas de modalité alternative","Pas de modalité alternative",null,"Conformité du mode d'administration / Divergence dans la prescription","Non Conformité du mode d'administration","Non Conformité du mode d'administration"]
["CHLORURE DE SODIUM","Toutes doses","CHLORURE DE SODIUMToutes doses","CHLORURE DE SODIUMToutes doses_Continue","Continue","Sang et organes hématopoïétique","IV : Gravité\nSC : Gravité\n1500mL à 2000mL /24h/site injection ou 1000mL/8h la nuit ou 500mL/2h","IV : Gravité\nSC : Gravité\n1500mL à 2000mL /24h/site injection ou 1000mL/8h la nuit ou 500mL/2h","IV : Gravité\nSC : Gravité\n1500mL à 2000mL /24h/site injection ou 1000mL/8h la nuit ou 500mL/2h","IV : Gravité\nSC : Gravité\n1500mL à 2000mL /24h/site injection ou 1000mL/8h la nuit ou 500mL/2h","IV : Gravité\nSC : Gravité\n1500mL à 2000mL /24h/site injection ou 1000mL/8h la nuit ou 500mL/2h",null,"Pas de modalité alternative","Pas de modalité alternative","Pas de modalité alternative",null,"Conformité du mode d'administration / Divergence dans la prescription","Non Conformité du mode d'administration","Non Conformité du mode d'administration"]
["CHLORURE DE SODIUM","Dose non renseignée","CHLORURE DE SODIUMDose non renseignée","CHLORURE DE SODIUMDose non renseignée_Continue","Continue","Sang et organes hématopoïétique","IV : Gravité\nSC : Gravité\n1500mL à 2000mL /24h/site injection ou 1000mL/8h la nuit ou 500mL/2h","IV : Gravité\nSC : Gravité\n1500mL à 2000mL /24h/site injection ou 1000mL/8h la nuit ou 500mL/2h","IV : Gravité\nSC : Gravité\n1500mL à 2000mL /24h/site injection ou 1000mL/8h la nuit ou 500mL/2h","IV : Gravité\nSC : Gravité\n1500mL à 2000mL /24h/site injection ou 1000mL/8h la nuit ou 500mL/2h","IV : Gravité\nSC : Gravité\n1500mL à 2000mL /24h/site injection ou 1000mL/8h la nuit ou 500mL/2h",null,"Pas de modalité alternative","Pas de modalité alternative","Pas de modalité alternative",null,"Conformité du mode d'administration / Divergence dans la prescription","Non Conformité du mode d'administration","Non Conformité du mode d'administration"]
["ERTAPENEME","Toutes doses","ERTAPENEMEToutes doses","ERTAPENEMEToutes doses_Continue","Continue","Antiinfectieux généraux à usage systémique","Gravité 30 min","Gravité 30 min","Gravité 30 min","Gravité 30 min","Gravité 30 min",null,"Pas de modalité alternative","Pas de modalité alternative","Pas de modalité alternative",null,"Conformité du mode d'administration / Divergence dans la prescription","Non Conformité du mode d'administration","Non Conformité du mode d'administration"]
["ERTAPENEME","Dose non renseignée","ERTAPENEMEDose non renseignée","ERTAPENEMEDose non renseignée_Continue","Continue","Antiinfectieux généraux à usage systémique","Gravité 30 min","Gravité 30 min","Gravité 30 min","Gravité 30 min","Gravité 30 min",null,"Pas de modalité alternative","Pas de modalité alternative","Pas de modalité alternative",null,"Conformité du mode d'administration / Divergence dans la prescription","Non Conformité du mode d'administration","Non Conformité du mode d'administration"]
["GENTAMICINE","Toutes doses","GENTAMICINEToutes doses","GENTAMICINEToutes doses_Continue","Continue","Antiinfectieux généraux à usage systémique","Gravité 30 min","Gravité 30 min","Gravité 30 min","Gravité 30 min","Gravité 30 min",null,"Pas de modalité alternative","Pas de modalité alternative","Pas de modalité alternative",null,"Conformité du mode d'administration / Divergence dans la prescription","Non Conformité du mode d'administration","Non Conformité du mode d'administration"]
["GENTAMICINE","Dose non renseignée","GENTAMICINEDose non renseignée","GENTAMICINEDose non renseignée_Continue","Continue","Antiinfectieux généraux à usage systémique","Gravité 30 min","Gravité 30 min","Gravité 30 min","Gravité 30 min","Gravité 30 min",null,"Pas de modalité alternative","Pas de modalité alternative","Pas de modalité alternative",null,"Conformité du mode d'administration / Divergence dans la prescription","Non Conformité du mode d'administration","Non Conformité du mode d'administration"]
["HEPARINE SODIQUE","Toutes doses","HEPARINE SODIQUEToutes doses","HEPARINE SODIQUEToutes doses_Continue","Continue","Sang et organes hématopoïétique","Administration en bolus : IVD lente\nPosologie initiale et entretien : PSE","Administration en bolus : IVD lente\nPosologie initiale et entretien : PSE","Administration en bolus : IVD lente\nPosologie initiale et entretien : PSE","Administration en bolus : IVD lente\nPosologie initiale et entretien : PSE","Administration en bolus : IVD lente\nPosologie initiale et entretien : PSE",null,"Pas de modalité alternative","Pas de modalité alternative","Pas de modalité alternative",null,"Non Conformité du mode d'administration / Divergence dans la prescription","Non Conformité du mode d'administration","Conformité du mode d'administration"]
["HEPARINE SODIQUE","Dose non renseignée","HEPARINE SODIQUEDose non renseignée","HEPARINE SODIQUEDose non renseignée_Continue","Continue","Sang et organes hématopoïétique","Administration en bolus : IVD lente\nPosologie initiale et entretien : PSE","Administration en bolus : IVD lente\nPosologie initiale et entretien : PSE","Administration en bolus : IVD lente\nPosologie initiale et entretien : PSE","Administration en bolus : IVD lente\nPosologie initiale et entretien : PSE","Administration en bolus : IVD lente\nPosologie initiale et entretien : PSE",null,"Pas de modalité alternative","Pas de modalité alternative","Pas de modalité alternative",null,"Non Conformité du mode d'administration / Divergence dans la prescription","Non Conformité du mode d'administration","Conformité du mode d'administration"]
["HYDRATE DE CARBONE SOLUTE GLUCOSE","Toutes doses","HYDRATE DE CARBONE SOLUTE GLUCOSEToutes doses","HYDRATE DE CARBONE SOLUTE GLUCOSEToutes doses_Continue","Continue","Sang et organes hématopoïétique","IV : Gravité\nSC : Gravité\n1500mL à 2000mL /24h/site injection\nou 1000mL/8h la nuit\nou 500mL/2h","IV : Gravité\nSC : Gravité\n1500mL à 2000mL /24h/site injection\nou 1000mL/8h la nuit\nou 500mL/2h","IV : Gravité\nSC : Gravité\n1500mL à 2000mL /24h/site injection\nou 1000mL/8h la nuit\nou 500mL/2h","IV : Gravité\nSC : Gravité\n1500mL à 2000mL /24h/site injection\nou 1000mL/8h la nuit\nou 500mL/2h","IV : Gravité\nSC : Gravité\n1500mL à 2000mL /24h/site injection\nou 1000mL/8h la nuit\nou 500mL/2h",null,"Pas de modalité alternative","Pas de modalité alternative","Pas de modalité alternative",null,"Conformité du mode d'administration / Divergence dans la prescription","Non Conformité du mode d'administration","Non Conformité du mode d'administration"]
["HYDRATE DE CARBONE SOLUTE GLUCOSE","Dose non renseignée","HYDRATE DE CARBONE SOLUTE GLUCOSEDose non renseignée","HYDRATE DE CARBONE SOLUTE GLUCOSEDose non renseignée_Continue","Continue","Sang et organes hématopoïétique","IV : Gravité\nSC : Gravité\n1500mL à 2000mL /24h/site injection\nou 1000mL/8h la nuit\nou 500mL/2h","IV : Gravité\nSC : Gravité\n1500mL à 2000mL /24h/site injection\nou 1000mL/8h la nuit\nou 500mL/2h","IV : Gravité\nSC : Gravité\n1500mL à 2000mL /24h/site injection\nou 1000mL/8h la nuit\nou 500mL/2h","IV : Gravité\nSC : Gravité\n1500mL à 2000mL /24h/site injection\nou 1000mL/8h la nuit\nou 500mL/2h","IV : Gravité\nSC : Gravité\n1500mL à 2000mL /24h/site injection\nou 1000mL/8h la nuit\nou 500mL/2h",null,"Pas de modalité alternative","Pas de modalité alternative","Pas de modalité alternative",null,"Conformité du mode d'administration / Divergence dans la prescription","Non Conformité du mode d'administration","Non Conformité du mode d'administration"]
["HYDRATE DE CARBONE SOLUTE GLUCOSE POLYIONIQUE PRETS À L EMPLOI","Toutes doses","HYDRATE DE CARBONE SOLUTE GLUCOSE POLYIONIQUE PRETS À L EMPLOIToutes doses","HYDRATE DE CARBONE SOLUTE GLUCOSE POLYIONIQUE PRETS À L EMPLOIToutes doses_Continue","Continue","Sang et organes hématopoïétique","IV : Gravité\n1500mL à 2000mL /24h/site injection\nou 1000mL/8h la nuit\nou 500mL/2h","IV : Gravité\n1500mL à 2000mL /24h/site injection\nou 1000mL/8h la nuit\nou 500mL/2h","IV : Gravité\n1500mL à 2000mL /24h/site injection\nou 1000mL/8h la nuit\nou 500mL/2h","IV : Gravité\n1500mL à 2000mL /24h/site injection\nou 1000mL/8h la nuit\nou 500mL/2h","IV : Gravité\n1500mL à 2000mL /24h/site injection\nou 1000mL/8h la nuit\nou 500mL/2h",null,"Pas de modalité alternative","Pas de modalité alternative","Pas de modalité alternative",null,"Conformité du mode d'administration / Divergence dans la prescription","Non Conformité du mode d'administration","Non Conformité du mode d'administration"]
["HYDRATE DE CARBONE SOLUTE GLUCOSE POLYIONIQUE PRETS À L EMPLOI","Dose non renseignée","HYDRATE DE CARBONE SOLUTE GLUCOSE POLYIONIQUE PRETS À L EMPLOIDose non renseignée","HYDRATE DE CARBONE SOLUTE GLUCOSE POLYIONIQUE PRETS À L EMPLOIDose non renseignée_Continue","Continue","Sang et organes hématopoïétique","IV : Gravité\n1500mL à 2000mL /24h/site injection\nou 1000mL/8h la nuit\nou 500mL/2h","IV : Gravité\n1500mL à 2000mL /24h/site injection\nou 1000mL/8h la nuit\nou 500mL/2h","IV : Gravité\n1500mL à 2000mL /24h/site injection\nou 1000mL/8h la nuit\nou 500mL/2h","IV : Gravité\n1500mL à 2000mL /24h/site injection\nou 1000mL/8h la nuit\nou 500mL/2h","IV : Gravité\n1500mL à 2000mL /24h/site injection\nou 1000mL/8h la nuit\nou 500mL/2h",null,"Pas de modalité alternative","Pas de modalité alternative","Pas de modalité alternative",null,"Conformité du mode d'administration / Divergence dans la prescription","Non Conformité du mode d'administration","Non Conformité du mode d'administration"]
["IMIPENEME CILASTATINE","Toutes doses","IMIPENEME CILASTATINEToutes doses","IMIPENEME CILASTATINEToutes doses_Continue","Continue","Antiinfectieux généraux à usage systémique","Dose ≤ 500mg : Gravité 20-30 min \nDose > 500mg : Gravité 40-60 min","Dose ≤ 500mg : Gravité 20-30 min \nDose > 500mg : Gravité 40-60 min","Dose ≤ 500mg : Gravité 20-30 min \nDose > 500mg : Gravité 40-60 min","Dose ≤ 500mg : Gravité 20-30 min \nDose > 500mg : Gravité 40-60 min","Dose ≤ 500mg : Gravité 20-30 min \nDose > 500mg : Gravité 40-60 min",null,"Pas de modalité alternative","Pas de modalité alternative","Pas de modalité alternative",null,"Conformité du mode d'administration / Divergence dans la prescription","Non Conformité du mode d'administration","Non Conformité du mode d'administration"]
["IMIPENEME CILASTATINE","Dose non renseignée","IMIPENEME CILASTATINEDose non renseignée","IMIPENEME CILASTATINEDose non renseignée_Continue","Continue","Antiinfectieux généraux à usage systémique","Dose ≤ 500mg : Gravité 20-30 min \nDose > 500mg : Gravité 40-60 min","Dose ≤ 500mg : Gravité 20-30 min \nDose > 500mg : Gravité 40-60 min","Dose ≤ 500mg : Gravité 20-30 min \nDose > 500mg : Gravité 40-60 min","Dose ≤ 500mg : Gravité 20-30 min \nDose > 500mg : Gravité 40-60 min","Dose ≤ 500mg : Gravité 20-30 min \nDose > 500mg : Gravité 40-60 min",null,"Pas de modalité alternative","Pas de modalité alternative","Pas de modalité alternative",null,"Conformité du mode d'administration / Divergence dans la prescription","Non Conformité du mode d'administration","Non Conformité du mode d'administration"]
["IMMUNOGLOBULINES POLYVALENTES IV","Toutes doses","IMMUNOGLOBULINES POLYVALENTES IVToutes doses","IMMUNOGLOBULINES POLYVALENTES IVToutes doses_Continue","Continue","Antiinfectieux généraux à usage systémique","Pompe","Pompe","Pompe","Pompe","Pompe",null,"Pas de modalité alternative","Pas de modalité alternative","Pas de modalité alternative",null,"Non Conformité du mode d'administration / Divergence dans la prescription","Non Conformité du mode d'administration","Conformité du mode d'administration"]
["IMMUNOGLOBULINES POLYVALENTES IV","Dose non renseignée","IMMUNOGLOBULINES POLYVALENTES IVDose non renseignée","IMMUNOGLOBULINES POLYVALENTES IVDose non renseignée_Continue","Continue","Antiinfectieux généraux à usage systémique","Pompe","Pompe","Pompe","Pompe","Pompe",null,"Pas de modalité alternative","Pas de modalité alternative","Pas de modalité alternative",null,"Non Conformité du mode d'administration / Divergence dans la prescription","Non Conformité du mode d'administration","Conformité du mode d'administration"]
["IMMUNOGLOBULINES POLYVALENTES SC","Toutes doses","IMMUNOGLOBULINES POLYVALENTES SCToutes doses","IMMUNOGLOBULINES POLYVALENTES SCToutes doses_Continue","Continue","Antiinfectieux généraux à usage systémique","Pompe ou PSE","Pompe ou PSE","Pompe ou PSE","Pompe ou PSE","Pompe ou PSE",null,"Pas de modalité alternative","Pas de modalité alternative","Pas de modalité alternative",null,"Non Conformité du mode d'administration / Divergence dans la prescription","Non Conformité du mode d'administration","Conformité du mode d'administration"]
["IMMUNOGLOBULINES POLYVALENTES SC","Dose non renseignée","IMMUNOGLOBULINES POLYVALENTES SCDose non renseignée","IMMUNOGLOBULINES POLYVALENTES SCDose non renseignée_Continue","Continue","Antiinfectieux généraux à usage systémique","Pompe ou PSE","Pompe ou PSE","Pompe ou PSE","Pompe ou PSE","Pompe ou PSE",null,"Pas de modalité alternative","Pas de modalité alternative","Pas de modalité alternative",null,"Non Conformité du mode d'administration / Divergence dans la prescription","Non Conformité du mode d'administration","Conformité du mode d'administration"]
["MEDICAMENT NON INTEGRE AU GUIDE DU ResOMeDIT","Toutes doses","MEDICAMENT NON INTEGRE AU GUIDE DU ResOMeDITToutes doses","MEDICAMENT NON INTEGRE AU GUIDE DU ResOMeDITToutes doses_Continue","Continue",null,null,null,null,null,null,null,"Pas de modalité alternative","Pas de modalité alternative","Pas de modalité alternative",null,"Situation non intégrée dans le guide ResOMeDIT","Situation non intégrée dans le guide ResOMeDIT","Situation non intégrée dans le guide ResOMeDIT"]
["MEDICAMENT NON INTEGRE AU GUIDE DU ResOMeDIT","Dose non renseignée","MEDICAMENT NON INTEGRE AU GUIDE DU ResOMeDITDose non renseignée","MEDICAMENT NON INTEGRE AU GUIDE DU ResOMeDITDose non renseignée_Continue","Continue",null,null,null,null,null,null,null,"Pas de modalité alternative","Pas de modalité alternative","Pas de modalité alternative",null,"Situation non intégrée dans le guide ResOMeDIT","Situation non intégrée dans le guide ResOMeDIT","Situation non intégrée dans le guide ResOMeDIT"]
["MEROPENEME","1g","MEROPENEME1g","MEROPENEME1g_Continue","Continue","Antiinfectieux généraux à usage systémique","1gx3/j : Gravité 30 min","1gx3/j : Gravité 30 min","1gx3/j : Gravité 30 min","1gx3/j : Gravité 30 min","1gx3/j : Gravité 30 min",null,"Pas de modalité alternative","Pas de modalité alternative","Pas de modalité alternative",null,"Conformité du mode d'administration / Divergence dans la prescription","Non Conformité du mode d'administration","Non Conformité du mode d'administration"]
["MEROPENEME","2g","MEROPENEME2g","MEROPENEME2g_Continue","Continue","Antiinfectieux généraux à usage systémique","2gx3/j : PSE sur 3h à 8h","2gx3/j : PSE sur 3h à 8h","2gx3/j : PSE sur 3h à 8h","2gx3/j : PSE sur 3h à 8h","2gx3/j : PSE sur 3h à 8h",null,"Pas de modalité alternative","Pas de modalité alternative","Pas de modalité alternative",null,"Non Conformité du mode d'administration / Divergence dans la prescription","Non Conformité du mode d'administration","Conformité du mode d'administration"]
["MEROPENEME","Autres doses","MEROPENEMEAutres doses","MEROPENEMEAutres doses_Continue","Continue","Antiinfectieux généraux à usage systémique","1gx3/j: Gravité 30 min\n2gx3/j : PSE sur 3h à 8h","1gx3/j: Gravité 30 min\n2gx3/j : PSE sur 3h à 8h","1gx3/j: Gravité 30 min\n2gx3/j : PSE sur 3h à 8h","1gx3/j: Gravité 30 min\n2gx3/j : PSE sur 3h à 8h","1gx3/j: Gravité 30 min\n2gx3/j : PSE sur 3h à 8h",null,"Pas de modalité alternative","Pas de modalité alternative","Pas de modalité alternative",null,"Situation non intégrée dans le guide ResOMeDIT","Situation non intégrée dans le guide ResOMeDIT","Situation non intégrée dans le guide ResOMeDIT"]
["MEROPENEME","Dose non renseignée","MEROPENEMEDose non renseignée","MEROPENEMEDose non renseignée_Continue","Continue","Antiinfectieux généraux à usage systémique","1gx3/j: Gravité 30 min\n2gx3/j : PSE sur 3h à 8h","1gx3/j: Gravité 30 min\n2gx3/j : PSE sur 3h à 8h","1gx3/j: Gravité 30 min\n2gx3/j : PSE sur 3h à 8h","1gx3/j: Gravité 30 min\n2gx3/j : PSE sur 3h à 8h","1gx3/j: Gravité 30 min\n2gx3/j : PSE sur 3h à 8h",null,"Pas de modalité alternative","Pas de modalité alternative","Pas de modalité alternative",null,"Non conformité : Prescription incomplète","Non conformité : Prescription incomplète","Non conformité : Prescription incomplète"]
["METHYLPREDNISOLONE","Toutes doses","METHYLPREDNISOLONEToutes doses","METHYLPREDNISOLONEToutes doses_Continue","Continue","Hormones systémiquess","Gravité 20-30 min","Gravité 20-30 min","Gravité 20-30 min","Gravité 20-30 min","Gravité 20-30 min",null,"Pas de modalité alternative","Pas de modalité alternative","Pas de modalité alternative",null,"Conformité du mode d'administration / Divergence dans la prescription","Non Conformité du mode d'administration","Non Conformité du mode d'administration"]
["METHYLPREDNISOLONE","Dose non renseignée","METHYLPREDNISOLONEDose non renseignée","METHYLPREDNISOLONEDose non renseignée_Continue","Continue","Hormones systémiquess","Gravité 20-30 min","Gravité 20-30 min","Gravité 20-30 min","Gravité 20-30 min","Gravité 20-30 min",null,"Pas de modalité alternative","Pas de modalité alternative","Pas de modalité alternative",null,"Conformité du mode d'administration / Divergence dans la prescription","Non Conformité du mode d'administration","Non Conformité du mode d'administration"]
["MIDAZOLAM","Toutes doses","MIDAZOLAMToutes doses","MIDAZOLAMToutes doses_Continue","Continue","Système nerveux","Administration en bolus : IVD lente\nAdministration en continu : PSE","Administration en bolus : IVD lente\nAdministration en continu : PSE","Administration en bolus : IVD lente\nAdministration en continu : PSE","Administration en bolus : IVD lente\nAdministration en continu : PSE","Administration en bolus : IVD lente\nAdministration en continu : PSE",null,"Pas de modalité alternative","Pas de modalité alternative","Pas de modalité alternative",null,"Non Conformité du mode d'administration / Divergence dans la prescription","Non Conformité du mode d'administration","Conformité du mode d'administration"]
["MIDAZOLAM","Dose non renseignée","MIDAZOLAMDose non renseignée","MIDAZOLAMDose non renseignée_Continue","Continue","Système nerveux","Administration en bolus : IVD lente\nAdministration en continu : PSE","Administration en bolus : IVD lente\nAdministration en continu : PSE","Administration en bolus : IVD lente\nAdministration en continu : PSE","Administration en bolus : IVD lente\nAdministration en continu : PSE","Administration en bolus : IVD lente\nAdministration en continu : PSE",null,"Pas de modalité alternative","Pas de modalité alternative","Pas de modalité alternative",null,"Non Conformité du mode d'administration / Divergence dans la prescription","Non Conformité du mode d'administration","Conformité du mode d'administration"]
["MORPHINE","Toutes doses","MORPHINEToutes doses","MORPHINEToutes doses_Continue","Continue","Système nerveux","Pompe PCA ","Pompe PCA ","Pompe PCA ","Pompe PCA ","Pompe PCA ",null,"Pas de modalité alternative","Pas de modalité alternative","Pas de modalité alternative",null,"Non Conformité du mode d'administration / Divergence dans la prescription","Non Conformité du mode d'administration","Conformité du mode d'administration"]
["MORPHINE","Dose non renseignée","MORPHINEDose non renseignée","MORPHINEDose non renseignée_Continue","Continue","Système nerveux","Pompe PCA ","Pompe PCA ","Pompe PCA ","Pompe PCA ","Pompe PCA ",null,"Pas de modalité alternative","Pas de modalité alternative","Pas de modalité alternative",null,"Non Conformité du mode d'administration / Divergence dans la prescription","Non Conformité du mode d'administration","Conformité du mode d'administration"]
["NEFOPAM","Toutes doses","NEFOPAMToutes doses","NEFOPAMToutes doses_Continue","Continue","Système nerveux","Gravité 15 à 30 min","Gravité 15 à 30 min","Gravité 15 à 30 min","Gravité 15 à 30 min","Gravité 15 à 30 min",null,"Diffuseur","Pas d'autre modalité alternative","Diffuseur",null,"Conformité du mode d'administration / Divergence dans la prescription","Modalité alternative d'administration","Non Conformité du mode d'administration"]
["NEFOPAM","Dose non renseignée","NEFOPAMDose non renseignée","NEFOPAMDose non renseignée_Continue","Continue","Système nerveux","Gravité 15 à 30 min","Gravité 15 à 30 min","Gravité 15 à 30 min","Gravité 15 à 30 min","Gravité 15 à 30 min",null,"Diffuseur","Pas d'autre modalité alternative","Diffuseur",null,"Conformité du mode d'administration / Divergence dans la prescription","Modalité alternative d'administration","Non Conformité du mode d'administration"]
["OXACILLINE","Toutes doses","OXACILLINEToutes doses","OXACILLINEToutes doses_Continue","Continue","Antiinfectieux généraux à usage systémique","Perfusion continue : Diffuseur sur 8h (respecter la Cmax)","Perfusion continue : Diffuseur sur 8h (respecter la Cmax)","Perfusion continue : Diffuseur sur 8h (respecter la Cmax)","Perfusion continue : Diffuseur sur 8h (respecter la Cmax)","Perfusion continue : Diffuseur sur 8h (respecter la Cmax)",null,"Pas d'autre modalité alternative","Administration discontinue : Gravité 30 à 60 min","Administration discontinue : Gravité 30 à 60 min",null,"Modalité alternative d'administration / Divergence dans la prescription","Conformité du mode d'administration","Non Conformité du mode d'administration"]
["OXACILLINE","Dose non renseignée","OXACILLINEDose non renseignée","OXACILLINEDose non renseignée_Continue","Continue","Antiinfectieux généraux à usage systémique","Perfusion continue : Diffuseur sur 8h (respecter la Cmax)","Perfusion continue : Diffuseur sur 8h (respecter la Cmax)","Perfusion continue : Diffuseur sur 8h (respecter la Cmax)","Perfusion continue : Diffuseur sur 8h (respecter la Cmax)","Perfusion continue : Diffuseur sur 8h (respecter la Cmax)",null,"Pas d'autre modalité alternative","Administration discontinue : Gravité 30 à 60 min","Administration discontinue : Gravité 30 à 60 min",null,"Modalité alternative d'administration / Divergence dans la prescription","Conformité du mode d'administration","Non Conformité du mode d'administration"]
["OXYCODONE","Toutes doses","OXYCODONEToutes doses","OXYCODONEToutes doses_Continue","Continue","Système nerveux","Pompe PCA","Pompe PCA","Pompe PCA","Pompe PCA","Pompe PCA",null,"Pas de modalité alternative","Pas de modalité alternative","Pas de modalité alternative",null,"Non Conformité du mode d'administration / Divergence dans la prescription","Non Conformité du mode d'administration","Conformité du mode d'administration"]
["OXYCODONE","Dose non renseignée","OXYCODONEDose non renseignée","OXYCODONEDose non renseignée_Continue","Continue","Système nerveux","Pompe PCA","Pompe PCA","Pompe PCA","Pompe PCA","Pompe PCA",null,"Pas de modalité alternative","Pas de modalité alternative","Pas de modalité alternative",null,"Non Conformité du mode d'administration / Divergence dans la prescription","Non Conformité du mode d'administration","Conformité du mode d'administration"]
["PIPERACILLINE-TAZOBACTAM","Toutes doses","PIPERACILLINE-TAZOBACTAMToutes doses","PIPERACILLINE-TAZOBACTAMToutes doses_Continue","Continue","Antiinfectieux généraux à usage systémique","En cas d'administration discontinue : Gravité 30 min\nEn cas de perfusion continue : Diffuseur sur 24h (respecter la Cmax)","En cas d'administration discontinue : Gravité 30 min\nEn cas de perfusion continue : Diffuseur sur 24h (respecter la Cmax)","En cas d'administration discontinue : Gravité 30 min\nEn cas de perfusion continue : Diffuseur sur 24h (respecter la Cmax)","En cas d'administration discontinue : Gravité 30 min\nEn cas de perfusion continue : Diffuseur sur 24h (respecter la Cmax)","En cas d'administration discontinue : Gravité 30 min\nEn cas de perfusion continue : Diffuseur sur 24h (respecter la Cmax)",null,"Pas de modalité alternative","Pas de modalité alternative","Pas de modalité alternative",null,"Conformité du mode d'administration / Divergence dans la prescription","Conformité du mode d'administration","Non Conformité du mode d'administration"]
["PIPERACILLINE-TAZOBACTAM","Dose non renseignée","PIPERACILLINE-TAZOBACTAMDose non renseignée","PIPERACILLINE-TAZOBACTAMDose non renseignée_Continue","Continue","Antiinfectieux généraux à usage systémique","En cas d'administration discontinue : Gravité 30 min\nEn cas de perfusion continue : Diffuseur sur 24h (respecter la Cmax)","En cas d'administration discontinue : Gravité 30 min\nEn cas de perfusion continue : Diffuseur sur 24h (respecter la Cmax)","En cas d'administration discontinue : Gravité 30 min\nEn cas de perfusion continue : Diffuseur sur 24h (respecter la Cmax)","En cas d'administration discontinue : Gravité 30 min\nEn cas de perfusion continue : Diffuseur sur 24h (respecter la Cmax)","En cas d'administration discontinue : Gravité 30 min\nEn cas de perfusion continue : Diffuseur sur 24h (respecter la Cmax)",null,"Pas de modalité alternative","Pas de modalité alternative","Pas de modalité alternative",null,"Conformité du mode d'administration / Divergence dans la prescription","Conformité du mode d'administration","Non Conformité du mode d'administration"]
["ROPIVACAINE","Toutes doses","ROPIVACAINEToutes doses","ROPIVACAINEToutes doses_Continue","Continue","Système nerveux","Pompe PCA ou Diffuseur","Pompe PCA ou Diffuseur","Pompe PCA ou Diffuseur","Pompe PCA ou Diffuseur","Pompe PCA ou Diffuseur","Pas de modalité alternative","Pas de modalité alternative","Pas de modalité alternative","Pas de modalité alternative","Situation non intégrée dans le guide ResOMeDIT","Non Conformité du mode d'administration / Divergence dans la prescription","Conformité du mode d'administration","Conformité du mode d'administration"]
["ROPIVACAINE","Dose non renseignée","ROPIVACAINEDose non renseignée","ROPIVACAINEDose non renseignée_Continue","Continue","Système nerveux","Pompe PCA ou Diffuseur","Pompe PCA ou Diffuseur","Pompe PCA ou Diffuseur","Pompe PCA ou Diffuseur","Pompe PCA ou Diffuseur",null,"Pas de modalité alternative","Pas de modalité alternative","Pas de modalité alternative",null,"Non Conformité du mode d'administration / Divergence dans la prescription","Conformité du mode d'administration","Conformité du mode d'administration"]
["TEICOPLANINE","Toutes doses","TEICOPLANINEToutes doses","TEICOPLANINEToutes doses_Continue","Continue","Antiinfectieux généraux à usage systémique","Gravité 30 min","Gravité 30 min","Gravité 30 min","Gravité 30 min","Gravité 30 min","Pas de modalité alternative","Pas de modalité alternative","Pas de modalité alternative","Pas de modalité alternative","Non Conformité du mode d'administration","Conformité du mode d'administration / Divergence dans la prescription","Non Conformité du mode d'administration","Non Conformité du mode d'administration"]
["TEICOPLANINE","Dose non renseignée","TEICOPLANINEDose non renseignée","TEICOPLANINEDose non renseignée_Continue","Continue","Antiinfectieux généraux à usage systémique","Gravité 30 min","Gravité 30 min","Gravité 30 min","Gravité 30 min","Gravité 30 min","Pas de modalité alternative","Pas de modalité alternative","Pas de modalité alternative","Pas de modalité alternative","Situation non intégrée dans le guide ResOMeDIT","Conformité du mode d'administration / Divergence dans la prescription","Non Conformité du mode d'administration","Non Conformité du mode d'administration"]
["TEMOCILLINE","Toutes doses","TEMOCILLINEToutes doses","TEMOCILLINEToutes doses_Continue","Continue","Antiinfectieux généraux à usage systémique","Perfusion continue : Diffuseur sur 24 h (respecter Cmax)\nAdministration discontinue : Gravité 30 min","Perfusion continue : Diffuseur sur 24 h (respecter Cmax)\nAdministration discontinue : Gravité 30 min","Perfusion continue : Diffuseur sur 24 h (respecter Cmax)\nAdministration discontinue : Gravité 30 min","Perfusion continue : Diffuseur sur 24 h (respecter Cmax)\nAdministration discontinue : Gravité 30 min","Perfusion continue : Diffuseur sur 24 h (respecter Cmax)\nAdministration discontinue : Gravité 30 min","Pas de modalité alternative","Pas de modalité alternative","Pas de modalité alternative","Pas de modalité alternative","Situation non intégrée dans le guide ResOMeDIT","Conformité du mode d'administration / Divergence dans la prescription","Conformité du mode d'administration","Non Conformité du mode d'administration"]
["TEMOCILLINE","Dose non renseignée","TEMOCILLINEDose non renseignée","TEMOCILLINEDose non renseignée_Continue","Continue","Antiinfectieux généraux à usage systémique","Perfusion continue : Diffuseur sur 24 h (respecter Cmax)\nAdministration discontinue : Gravité 30 min","Perfusion continue : Diffuseur sur 24 h (respecter Cmax)\nAdministration discontinue : Gravité 30 min","Perfusion continue : Diffuseur sur 24 h (respecter Cmax)\nAdministration discontinue : Gravité 30 min","Perfusion continue : Diffuseur sur 24 h (respecter Cmax)\nAdministration discontinue : Gravité 30 min","Perfusion continue : Diffuseur sur 24 h (respecter Cmax)\nAdministration discontinue : Gravité 30 min","2 g : Gravité 30 min","Pas de modalité alternative","Pas de modalité alternative","Pas de modalité alternative","Non Conformité du mode d'administration","Conformité du mode d'administration / Divergence dans la prescription","Conformité du mode d'administration","Non Conformité du mode d'administration"]
["TOBRAMYCINE","Toutes doses","TOBRAMYCINEToutes doses","TOBRAMYCINEToutes doses_Continue","Continue","Antiinfectieux généraux à usage systémique","Gravité 30 min","Gravité 30 min","Gravité 30 min","Gravité 30 min","Gravité 30 min","Gravité 30 min","Pas de modalité alternative","Pas de modalité alternative","Pas de modalité alternative","Conformité du mode d'administration","Conformité du mode d'administration / Divergence dans la prescription","Non Conformité du mode d'administration","Non Conformité du mode d'administration"]
["TOBRAMYCINE","Dose non renseignée","TOBRAMYCINEDose non renseignée","TOBRAMYCINEDose non renseignée_Continue","Continue","Antiinfectieux généraux à usage systémique","Gravité 30 min","Gravité 30 min","Gravité 30 min","Gravité 30 min","Gravité 30 min","Pas de modalité alternative","Pas de modalité alternative","Pas de modalité alternative","Pas de modalité alternative","Non Conformité : Prescription Incomplète","Conformité du mode d'administration / Divergence dans la prescription","Non Conformité du mode d'administration","Non Conformité du mode d'administration"]
["VANCOMYCINE","Toutes doses","VANCOMYCINEToutes doses","VANCOMYCINEToutes doses_Continue","Continue","Antiinfectieux généraux à usage systémique","Perfusion continue sur voie veineuse centrale : Diffuseur sur 24h (respecter Cmax)","Perfusion continue sur voie veineuse centrale : Diffuseur sur 24h (respecter Cmax)","Perfusion continue sur voie veineuse centrale : Diffuseur sur 24h (respecter Cmax)","Perfusion continue sur voie veineuse centrale : Diffuseur sur 24h (respecter Cmax)","Perfusion continue sur voie veineuse centrale : Diffuseur sur 24h (respecter Cmax)","Pas de modalité alternative","Pas d'autre modalité alternative","Administration discontinue sur voie veineuse périphérique : Gravité 60 min","Administration discontinue sur voie veineuse périphérique : Gravité 60 min","Conformité du mode d'administration","Modalité alternative d'administration / Divergence dans la prescription","Conformité du mode d'administration","Non Conformité du mode d'administration"]
["VANCOMYCINE","Dose non renseignée","VANCOMYCINEDose non renseignée","VANCOMYCINEDose non renseignée_Continue","Continue","Antiinfectieux généraux à usage systémique","Perfusion continue sur voie veineuse centrale : Diffuseur sur 24h (respecter Cmax)","Perfusion continue sur voie veineuse centrale : Diffuseur sur 24h (respecter Cmax)","Perfusion continue sur voie veineuse centrale : Diffuseur sur 24h (respecter Cmax)","Perfusion continue sur voie veineuse centrale : Diffuseur sur 24h (respecter Cmax)","Perfusion continue sur voie veineuse centrale : Diffuseur sur 24h (respecter Cmax)","Gravité 30 min","Pas d'autre modalité alternative","Administration discontinue sur voie veineuse périphérique : Gravité 60 min","Administration discontinue sur voie veineuse périphérique : Gravité 60 min","Conformité du mode d'administration","Modalité alternative d'administration / Divergence dans la prescription","Conformité du mode d'administration","Non Conformité du mode d'administration"]
["5 FU","Toutes doses","5 FUToutes doses","5 FUToutes doses_Discontinue","Discontinue","Antinéoplasiques et immunomodulateurs","Diffuseur\r","Diffuseur\r","Diffuseur\r","Diffuseur\r","Diffuseur\r","L’utilisation d’un pousse seringue électrique (PSE) à la place d’une pompe PCA n'est pas recommandée.","Pas de modalité alternative","Pas de modalité alternative","Pas de modalité alternative","Non Conformité du mode d'administration","Non Conformité du mode d'administration","Conformité du mode d'administration / Divergence dans la prescription","Non Conformité du mode d'administration / Divergence dans la prescription"]
["5 FU","Dose non renseignée","5 FUDose non renseignée","5 FUDose non renseignée_Discontinue","Discontinue","Antinéoplasiques et immunomodulateurs","Diffuseur\r","Diffuseur\r","Diffuseur\r","Diffuseur\r","Diffuseur\r","Pas de modalité alternative","Pas de modalité alternative","Pas de modalité alternative","Pas de modalité alternative","Conformité du mode d'administration","Non Conformité du mode d'administration","Conformité du mode d'administration / Divergence dans la prescription","Non Conformité du mode d'administration / Divergence dans la prescription"]
["ACIDE ZOLEDRONIQUE","Toutes doses","ACIDE ZOLEDRONIQUEToutes doses","ACIDE ZOLEDRONIQUEToutes doses_Discontinue","Discontinue","Muscle et squelette","Gravité 15-30 min","Gravité 15-30 min","Gravité 15-30 min","Gravité 15-30 min","Gravité 15-30 min","Pas de modalité alternative","Pas de modalité alternative","Pas de modalité alternative","Pas de modalité alternative","Non Conformité du mode d'administration","Conformité du mode d'administration","Non Conformité du mode d'administration / Divergence dans la prescription","Non Conformité du mode d'administration / Divergence dans la prescription"]
["ACIDE ZOLEDRONIQUE","Dose non renseignée","ACIDE ZOLEDRONIQUEDose non renseignée","ACIDE ZOLEDRONIQUEDose non renseignée_Discontinue","Discontinue","Muscle et squelette","Gravité 15-30 min","Gravité 15-30 min","Gravité 15-30 min","Gravité 15-30 min","Gravité 15-30 min","L’utilisation d’un pousse seringue électrique (PSE) à la place d’une pompe PCA n'est pas recommandée.","Pas de modalité alternative","Pas de modalité alternative","Pas de modalité alternative","Non Conformité du mode d'administration","Conformité du mode d'administration","Non Conformité du mode d'administration / Divergence dans la prescription","Non Conformité du mode d'administration / Divergence dans la prescription"]
["AMIKACINE","Toutes doses","AMIKACINEToutes doses","AMIKACINEToutes doses_Discontinue","Discontinue","Antiinfectieux généraux à usage systémique","Gravité 30 min","Gravité 30 min","Gravité 30 min","Gravité 30 min","Gravité 30 min","Administration discontinue :\nGravité 30 à 60 min","Pas de modalité alternative","Pas de modalité alternative","Pas de modalité alternative","Non Conformité du mode d'administration","Conformité du mode d'administration","Non Conformité du mode d'administration / Divergence dans la prescription","Non Conformité du mode d'administration / Divergence dans la prescription"]
["AMIKACINE","Dose non renseignée","AMIKACINEDose non renseignée","AMIKACINEDose non renseignée_Discontinue","Discontinue","Antiinfectieux généraux à usage systémique","Gravité 30 min","Gravité 30 min","Gravité 30 min","Gravité 30 min","Gravité 30 min","Pas de modalité alternative","Pas de modalité alternative","Pas de modalité alternative","Pas de modalité alternative","Non Conformité du mode d'administration","Conformité du mode d'administration","Non Conformité du mode d'administration / Divergence dans la prescription","Non Conformité du mode d'administration / Divergence dans la prescription"]
["AMOXICILLINE","Toutes doses","AMOXICILLINEToutes doses","AMOXICILLINEToutes doses_Discontinue","Discontinue","Antiinfectieux généraux à usage systémique","Administration discontinue : Gravité 30 min\nPerfusion continue et en fonction de la mobilité du patient : Diffuseur sur 12H (respecter la Cmax)","Administration discontinue : Gravité 30 min\nPerfusion continue et en fonction de la mobilité du patient : Diffuseur sur 12H (respecter la Cmax)","Administration discontinue : Gravité 30 min\nPerfusion continue et en fonction de la mobilité du patient : Diffuseur sur 12H (respecter la Cmax)","Administration discontinue : Gravité 30 min\nPerfusion continue et en fonction de la mobilité du patient : Diffuseur sur 12H (respecter la Cmax)","Administration discontinue : Gravité 30 min\nPerfusion continue et en fonction de la mobilité du patient : Diffuseur sur 12H (respecter la Cmax)",null,"Pas de modalité alternative","Pas de modalité alternative","Pas de modalité alternative","Non Conformité du mode d'administration","Conformité du mode d'administration","Conformité du mode d'administration / Divergence dans la prescription","Non Conformité du mode d'administration / Divergence dans la prescription"]
["AMOXICILLINE","Dose non renseignée","AMOXICILLINEDose non renseignée","AMOXICILLINEDose non renseignée_Discontinue","Discontinue","Antiinfectieux généraux à usage systémique","Administration discontinue : Gravité 30 min\nPerfusion continue et en fonction de la mobilité du patient : Diffuseur sur 12H (respecter la Cmax)","Administration discontinue : Gravité 30 min\nPerfusion continue et en fonction de la mobilité du patient : Diffuseur sur 12H (respecter la Cmax)","Administration discontinue : Gravité 30 min\nPerfusion continue et en fonction de la mobilité du patient : Diffuseur sur 12H (respecter la Cmax)","Administration discontinue : Gravité 30 min\nPerfusion continue et en fonction de la mobilité du patient : Diffuseur sur 12H (respecter la Cmax)","Administration discontinue : Gravité 30 min\nPerfusion continue et en fonction de la mobilité du patient : Diffuseur sur 12H (respecter la Cmax)",null,"Pas de modalité alternative","Pas de modalité alternative","Pas de modalité alternative","Non Conformité : Prescription Incomplète","Conformité du mode d'administration","Conformité du mode d'administration / Divergence dans la prescription","Non Conformité du mode d'administration / Divergence dans la prescription"]
["AMOXICILLINE ACIDE CLAVULANIQUE","Toutes doses","AMOXICILLINE ACIDE CLAVULANIQUEToutes doses","AMOXICILLINE ACIDE CLAVULANIQUEToutes doses_Discontinue","Discontinue","Antiinfectieux généraux à usage systémique","Gravité 30 min","Gravité 30 min","Gravité 30 min","Gravité 30 min","Gravité 30 min","Pas de modalité alternative","Pas de modalité alternative","Pas de modalité alternative","Pas de modalité alternative","Non Conformité du mode d'administration","Conformité du mode d'administration","Non Conformité du mode d'administration / Divergence dans la prescription","Non Conformité du mode d'administration / Divergence dans la prescription"]
["AMOXICILLINE ACIDE CLAVULANIQUE","Dose non renseignée","AMOXICILLINE ACIDE CLAVULANIQUEDose non renseignée","AMOXICILLINE ACIDE CLAVULANIQUEDose non renseignée_Discontinue","Discontinue","Antiinfectieux généraux à usage systémique","Gravité 30 min","Gravité 30 min","Gravité 30 min","Gravité 30 min","Gravité 30 min","L’utilisation d’un pousse seringue électrique (PSE) à la place d’une pompe PCA n'est pas recommandée.","Pas de modalité alternative","Pas de modalité alternative","Pas de modalité alternative","Non Conformité du mode d'administration","Conformité du mode d'administration","Non Conformité du mode d'administration / Divergence dans la prescription","Non Conformité du mode d'administration / Divergence dans la prescription"]
["AMPHOTERICINE B FUNGIZONE","Toutes doses","AMPHOTERICINE B FUNGIZONEToutes doses","AMPHOTERICINE B FUNGIZONEToutes doses_Discontinue","Discontinue","Antiinfectieux généraux à usage systémique","Dose test : IV lente (20-30 minutes)\nPompe administration en 2 à 6h","Dose test : IV lente (20-30 minutes)\nPompe administration en 2 à 6h","Dose test : IV lente (20-30 minutes)\nPompe administration en 2 à 6h","Dose test : IV lente (20-30 minutes)\nPompe administration en 2 à 6h","Dose test : IV lente (20-30 minutes)\nPompe administration en 2 à 6h","Pas de modalité alternative","Pas d'autre modalité alternative","Gravité 2 à 6 heures si envisageable","Gravité 2 à 6 heures si envisageable","Non Conformité du mode d'administration","Modalité alternative d'administration","Non Conformité du mode d'administration / Divergence dans la prescription","Conformité du mode d'administration / Divergence dans la prescription"]
["AMPHOTERICINE B FUNGIZONE","Dose non renseignée","AMPHOTERICINE B FUNGIZONEDose non renseignée","AMPHOTERICINE B FUNGIZONEDose non renseignée_Discontinue","Discontinue","Antiinfectieux généraux à usage systémique","Dose test : IV lente (20-30 minutes)\nPompe administration en 2 à 6h","Dose test : IV lente (20-30 minutes)\nPompe administration en 2 à 6h","Dose test : IV lente (20-30 minutes)\nPompe administration en 2 à 6h","Dose test : IV lente (20-30 minutes)\nPompe administration en 2 à 6h","Dose test : IV lente (20-30 minutes)\nPompe administration en 2 à 6h","Pas de modalité alternative","Pas d'autre modalité alternative","Gravité 2 à 6 heures si envisageable","Gravité 2 à 6 heures si envisageable","Non Conformité du mode d'administration","Modalité alternative d'administration","Non Conformité du mode d'administration / Divergence dans la prescription","Conformité du mode d'administration / Divergence dans la prescription"]
["AMPHOTERICINE B LIPOSOMALE AMBISOME","Toutes doses","AMPHOTERICINE B LIPOSOMALE AMBISOMEToutes doses","AMPHOTERICINE B LIPOSOMALE AMBISOMEToutes doses_Discontinue","Discontinue","Antiinfectieux généraux à usage systémique","Gravité 30-60 min (prolonger la durée si perfusion mal tolérée)","Gravité 30-60 min (prolonger la durée si perfusion mal tolérée)","Gravité 30-60 min (prolonger la durée si perfusion mal tolérée)","Gravité 30-60 min (prolonger la durée si perfusion mal tolérée)","Gravité 30-60 min (prolonger la durée si perfusion mal tolérée)","Pas de modalité alternative","Pompe (si perfusion de 2 à 4 heures en cas de posologie supérieure à 3mg/kg/j)","Pompe (si perfusion de 2 à 4 heures en cas de posologie supérieure à 3mg/kg/j)","Pas d'autre modalité alternative","Non Conformité : Prescription Incomplète","Conformité du mode d'administration","Non Conformité du mode d'administration / Divergence dans la prescription","Modalité alternative d'administration / Divergence dans la prescription"]
["AMPHOTERICINE B LIPOSOMALE AMBISOME","Dose non renseignée","AMPHOTERICINE B LIPOSOMALE AMBISOMEDose non renseignée","AMPHOTERICINE B LIPOSOMALE AMBISOMEDose non renseignée_Discontinue","Discontinue","Antiinfectieux généraux à usage systémique","Gravité 30-60 min (prolonger la durée si perfusion mal tolérée)","Gravité 30-60 min (prolonger la durée si perfusion mal tolérée)","Gravité 30-60 min (prolonger la durée si perfusion mal tolérée)","Gravité 30-60 min (prolonger la durée si perfusion mal tolérée)","Gravité 30-60 min (prolonger la durée si perfusion mal tolérée)","Pas de modalité alternative","Pompe (si perfusion de 2 à 4 heures en cas de posologie supérieure à 3mg/kg/j)","Pompe (si perfusion de 2 à 4 heures en cas de posologie supérieure à 3mg/kg/j)","Pas d'autre modalité alternative","Situation non intégrée dans le guide ResOMeDIT","Conformité du mode d'administration","Non Conformité du mode d'administration / Divergence dans la prescription","Modalité alternative d'administration / Divergence dans la prescription"]
["APOMORPHINE","Toutes doses","APOMORPHINEToutes doses","APOMORPHINEToutes doses_Discontinue","Discontinue","Système nerveux","Pompe ou PSE","Pompe ou PSE","Pompe ou PSE","Pompe ou PSE","Pompe ou PSE","Pas de modalité alternative","Pas de modalité alternative","Pas de modalité alternative","Pas de modalité alternative","Non Conformité du mode d'administration","Non Conformité du mode d'administration","Non Conformité du mode d'administration / Divergence dans la prescription","Conformité du mode d'administration / Divergence dans la prescription"]
["APOMORPHINE","Dose non renseignée","APOMORPHINEDose non renseignée","APOMORPHINEDose non renseignée_Discontinue","Discontinue","Système nerveux","Pompe ou PSE","Pompe ou PSE","Pompe ou PSE","Pompe ou PSE","Pompe ou PSE","Pas de modalité alternative","Pas de modalité alternative","Pas de modalité alternative","Pas de modalité alternative","Non Conformité du mode d'administration","Non Conformité du mode d'administration","Non Conformité du mode d'administration / Divergence dans la prescription","Conformité du mode d'administration / Divergence dans la prescription"]
["AZTREONAM","Toutes doses","AZTREONAMToutes doses","AZTREONAMToutes doses_Discontinue","Discontinue","Antiinfectieux généraux à usage systémique","Perfusion continue : Diffuseur sur 24h (respecter Cmax)\nAdministration discontinue : Gravité 30 min","Perfusion continue : Diffuseur sur 24h (respecter Cmax)\nAdministration discontinue : Gravité 30 min","Perfusion continue : Diffuseur sur 24h (respecter Cmax)\nAdministration discontinue : Gravité 30 min","Perfusion continue : Diffuseur sur 24h (respecter Cmax)\nAdministration discontinue : Gravité 30 min","Perfusion continue : Diffuseur sur 24h (respecter Cmax)\nAdministration discontinue : Gravité 30 min","Pas de modalité alternative","Pas de modalité alternative","Pas de modalité alternative","Pas de modalité alternative","Non Conformité du mode d'administration","Conformité du mode d'administration","Conformité du mode d'administration / Divergence dans la prescription","Non Conformité du mode d'administration / Divergence dans la prescription"]
["AZTREONAM","Dose non renseignée","AZTREONAMDose non renseignée","AZTREONAMDose non renseignée_Discontinue","Discontinue","Antiinfectieux généraux à usage systémique","Perfusion continue : Diffuseur sur 24h (respecter Cmax)\nAdministration discontinue : Gravité 30 min","Perfusion continue : Diffuseur sur 24h (respecter Cmax)\nAdministration discontinue : Gravité 30 min","Perfusion continue : Diffuseur sur 24h (respecter Cmax)\nAdministration discontinue : Gravité 30 min","Perfusion continue : Diffuseur sur 24h (respecter Cmax)\nAdministration discontinue : Gravité 30 min","Perfusion continue : Diffuseur sur 24h (respecter Cmax)\nAdministration discontinue : Gravité 30 min","Pas de modalité alternative","Pas de modalité alternative","Pas de modalité alternative","Pas de modalité alternative","Non Conformité du mode d'administration","Conformité du mode d'administration","Conformité du mode d'administration / Divergence dans la prescription","Non Conformité du mode d'administration / Divergence dans la prescription"]
["BETAMETHASONE","Toutes doses","BETAMETHASONEToutes doses","BETAMETHASONEToutes doses_Discontinue","Discontinue","Hormones systémiquess","Gravité 15-30 min","Gravité 15-30 min","Gravité 15-30 min","Gravité 15-30 min","Gravité 15-30 min","Pas de modalité alternative","Pas de modalité alternative","Pas de modalité alternative","Pas de modalité alternative","Non Conformité du mode d'administration","Conformité du mode d'administration","Non Conformité du mode d'administration / Divergence dans la prescription","Non Conformité du mode d'administration / Divergence dans la prescription"]
["BETAMETHASONE","Dose non renseignée","BETAMETHASONEDose non renseignée","BETAMETHASONEDose non renseignée_Discontinue","Discontinue","Hormones systémiquess","Gravité 15-30 min","Gravité 15-30 min","Gravité 15-30 min","Gravité 15-30 min","Gravité 15-30 min","Pas de modalité alternative","Pas de modalité alternative","Pas de modalité alternative","Pas de modalité alternative","Non Conformité du mode d'administration","Conformité du mode d'administration","Non Conformité du mode d'administration / Divergence dans la prescription","Non Conformité du mode d'administration / Divergence dans la prescription"]
["CASPOFUNGINE","Toutes doses","CASPOFUNGINEToutes doses","CASPOFUNGINEToutes doses_Discontinue","Discontinue","Antiinfectieux généraux à usage systémique","Gravité 60 min","Gravité 60 min","Gravité 60 min","Gravité 60 min","Gravité 60 min","Pas de modalité alternative","En cas de mobilité du patient :\n50mg : Diffuseur vol mini 100 mL 60 min\n70mg : Diffuseur vol mini 250 mL 60 min","Pas d'autre modalité alternative","En cas de mobilité du patient :\n50mg : Diffuseur vol mini 100 mL 60 min\n70mg : Diffuseur vol mini 250 mL 60 min","Situation non intégrée dans le guide ResOMeDIT","Conformité du mode d'administration","Modalité alternative d'administration / Divergence dans la prescription","Non Conformité du mode d'administration / Divergence dans la prescription"]
["CASPOFUNGINE","Dose non renseignée","CASPOFUNGINEDose non renseignée","CASPOFUNGINEDose non renseignée_Discontinue","Discontinue","Antiinfectieux généraux à usage systémique","Gravité 60 min","Gravité 60 min","Gravité 60 min","Gravité 60 min","Gravité 60 min","Pas de modalité alternative","En cas de mobilité du patient :\n50mg : Diffuseur vol mini 100 mL 60 min\n70mg : Diffuseur vol mini 250 mL 60 min","Pas d'autre modalité alternative","En cas de mobilité du patient :\n50mg : Diffuseur vol mini 100 mL 60 min\n70mg : Diffuseur vol mini 250 mL 60 min","Non Conformité du mode d'administration","Conformité du mode d'administration","Modalité alternative d'administration / Divergence dans la prescription","Non Conformité du mode d'administration / Divergence dans la prescription"]
["CEFEPIME","Toutes doses","CEFEPIMEToutes doses","CEFEPIMEToutes doses_Discontinue","Discontinue","Antiinfectieux généraux à usage systémique","Perfusion continue : Diffuseur sur 12h (respecter la Cmax)\nAdministration discontinue : Gravité 30 min","Perfusion continue : Diffuseur sur 12h (respecter la Cmax)\nAdministration discontinue : Gravité 30 min","Perfusion continue : Diffuseur sur 12h (respecter la Cmax)\nAdministration discontinue : Gravité 30 min","Perfusion continue : Diffuseur sur 12h (respecter la Cmax)\nAdministration discontinue : Gravité 30 min","Perfusion continue : Diffuseur sur 12h (respecter la Cmax)\nAdministration discontinue : Gravité 30 min","Pas de modalité alternative","Pas de modalité alternative","Pas de modalité alternative","Pas de modalité alternative","Non Conformité du mode d'administration","Conformité du mode d'administration","Conformité du mode d'administration / Divergence dans la prescription","Non Conformité du mode d'administration / Divergence dans la prescription"]
["CEFEPIME","Dose non renseignée","CEFEPIMEDose non renseignée","CEFEPIMEDose non renseignée_Discontinue","Discontinue","Antiinfectieux généraux à usage systémique","Perfusion continue : Diffuseur sur 12h (respecter la Cmax)\nAdministration discontinue : Gravité 30 min","Perfusion continue : Diffuseur sur 12h (respecter la Cmax)\nAdministration discontinue : Gravité 30 min","Perfusion continue : Diffuseur sur 12h (respecter la Cmax)\nAdministration discontinue : Gravité 30 min","Perfusion continue : Diffuseur sur 12h (respecter la Cmax)\nAdministration discontinue : Gravité 30 min","Perfusion continue : Diffuseur sur 12h (respecter la Cmax)\nAdministration discontinue : Gravité 30 min","Pas de modalité alternative","Pas de modalité alternative","Pas de modalité alternative","Pas de modalité alternative","Non Conformité : Prescription Incomplète","Conformité du mode d'administration","Conformité du mode d'administration / Divergence dans la prescription","Non Conformité du mode d'administration / Divergence dans la prescription"]
["CEFOXITINE","Toutes doses","CEFOXITINEToutes doses","CEFOXITINEToutes doses_Discontinue","Discontinue","Antiinfectieux généraux à usage systémique","Perfusion continue : Diffuseur sur 12h (respecter la Cmax)","Perfusion continue : Diffuseur sur 12h (respecter la Cmax)","Perfusion continue : Diffuseur sur 12h (respecter la Cmax)","Perfusion continue : Diffuseur sur 12h (respecter la Cmax)","Perfusion continue : Diffuseur sur 12h (respecter la Cmax)","Administration discontinue sur voie veineuse périphérique :\nGravité 60 min","Pas de modalité alternative","Pas de modalité alternative","Pas de modalité alternative","Non Conformité du mode d'administration","Non Conformité du mode d'administration","Conformité du mode d'administration / Divergence dans la prescription","Non Conformité du mode d'administration / Divergence dans la prescription"]
["CEFOXITINE","Dose non renseignée","CEFOXITINEDose non renseignée","CEFOXITINEDose non renseignée_Discontinue","Discontinue","Antiinfectieux généraux à usage systémique","Perfusion continue : Diffuseur sur 12h (respecter la Cmax)","Perfusion continue : Diffuseur sur 12h (respecter la Cmax)","Perfusion continue : Diffuseur sur 12h (respecter la Cmax)","Perfusion continue : Diffuseur sur 12h (respecter la Cmax)","Perfusion continue : Diffuseur sur 12h (respecter la Cmax)","Pas de modalité alternative","Pas de modalité alternative","Pas de modalité alternative","Pas de modalité alternative","Non Conformité du mode d'administration","Non Conformité du mode d'administration","Conformité du mode d'administration / Divergence dans la prescription","Non Conformité du mode d'administration / Divergence dans la prescription"]
["CEFTAZIDIME","Toutes doses","CEFTAZIDIMEToutes doses","CEFTAZIDIMEToutes doses_Discontinue","Discontinue","Antiinfectieux généraux à usage systémique","Perfusion continue : Diffuseur sur 8h (respecter Cmax)\nAdministration discontinue : Gravité 30 min","Perfusion continue : Diffuseur sur 12h (respecter Cmax)\nAdministration discontinue : Gravité 30 min","Perfusion continue : Diffuseur sur 12h (respecter Cmax)\nAdministration discontinue : Gravité 30 min","Perfusion continue : Diffuseur sur 12h (respecter Cmax)\nAdministration discontinue : Gravité 30 min","Perfusion continue : Diffuseur sur 12h (respecter Cmax)\nAdministration discontinue : Gravité 30 min","Administration discontinue sur voie veineuse périphérique :\nGravité 60 min","Pas de modalité alternative","Pas de modalité alternative","Pas de modalité alternative","Non Conformité du mode d'administration","Conformité du mode d'administration","Conformité du mode d'administration / Divergence dans la prescription","Non Conformité du mode d'administration / Divergence dans la prescription"]
["CEFTAZIDIME","Dose non renseignée","CEFTAZIDIMEDose non renseignée","CEFTAZIDIMEDose non renseignée_Discontinue","Discontinue","Antiinfectieux généraux à usage systémique","Perfusion continue : Diffuseur sur 8h (respecter Cmax)\nAdministration discontinue : Gravité 30 min","Perfusion continue : Diffuseur sur 12h (respecter Cmax)\nAdministration discontinue : Gravité 30 min","Perfusion continue : Diffuseur sur 12h (respecter Cmax)\nAdministration discontinue : Gravité 30 min","Perfusion continue : Diffuseur sur 12h (respecter Cmax)\nAdministration discontinue : Gravité 30 min","Perfusion continue : Diffuseur sur 12h (respecter Cmax)\nAdministration discontinue : Gravité 30 min","Administration discontinue sur voie veineuse périphérique :\nGravité 60 min","Pas de modalité alternative","Pas de modalité alternative","Pas de modalité alternative","Non Conformité du mode d'administration","Conformité du mode d'administration","Conformité du mode d'administration / Divergence dans la prescription","Non Conformité du mode d'administration / Divergence dans la prescription"]
["CEFTRIAXONE","Toutes doses","CEFTRIAXONEToutes doses","CEFTRIAXONEToutes doses_Discontinue","Discontinue","Antiinfectieux généraux à usage systémique","Gravité 30 minutes","Gravité 30 minutes","Gravité 30 minutes","Gravité 30 minutes","Gravité 30 minutes","Administration discontinue sur voie veineuse périphérique :\nGravité 60 min","Pas de modalité alternative","Pas de modalité alternative","Pas de modalité alternative","Situation non intégrée dans le guide ResOMeDIT","Conformité du mode d'administration","Non Conformité du mode d'administration / Divergence dans la prescription","Non Conformité du mode d'administration / Divergence dans la prescription"]
["CEFTRIAXONE","Dose non renseignée","CEFTRIAXONEDose non renseignée","CEFTRIAXONEDose non renseignée_Discontinue","Discontinue","Antiinfectieux généraux à usage systémique","Gravité 30 minutes","Gravité 30 minutes","Gravité 30 minutes","Gravité 30 minutes","Gravité 30 minutes","Administration discontinue sur voie veineuse périphérique :\nGravité 60 min","Pas de modalité alternative","Pas de modalité alternative","Pas de modalité alternative","Non Conformité du mode d'administration","Conformité du mode d'administration","Non Conformité du mode d'administration / Divergence dans la prescription","Non Conformité du mode d'administration / Divergence dans la prescription"]
["CHLORURE DE SODIUM","Toutes doses","CHLORURE DE SODIUMToutes doses","CHLORURE DE SODIUMToutes doses_Discontinue","Discontinue","Sang et organes hématopoïétique","IV : Gravité\nSC : Gravité\n1500mL à 2000mL /24h/site injection ou 1000mL/8h la nuit ou 500mL/2h","IV : Gravité\nSC : Gravité\n1500mL à 2000mL /24h/site injection ou 1000mL/8h la nuit ou 500mL/2h","IV : Gravité\nSC : Gravité\n1500mL à 2000mL /24h/site injection ou 1000mL/8h la nuit ou 500mL/2h","IV : Gravité\nSC : Gravité\n1500mL à 2000mL /24h/site injection ou 1000mL/8h la nuit ou 500mL/2h","IV : Gravité\nSC : Gravité\n1500mL à 2000mL /24h/site injection ou 1000mL/8h la nuit ou 500mL/2h",null,"Pas de modalité alternative","Pas de modalité alternative","Pas de modalité alternative",null,"Conformité du mode d'administration","Non Conformité du mode d'administration / Divergence dans la prescription","Non Conformité du mode d'administration / Divergence dans la prescription"]
["CHLORURE DE SODIUM","Dose non renseignée","CHLORURE DE SODIUMDose non renseignée","CHLORURE DE SODIUMDose non renseignée_Discontinue","Discontinue","Sang et organes hématopoïétique","IV : Gravité\nSC : Gravité\n1500mL à 2000mL /24h/site injection ou 1000mL/8h la nuit ou 500mL/2h","IV : Gravité\nSC : Gravité\n1500mL à 2000mL /24h/site injection ou 1000mL/8h la nuit ou 500mL/2h","IV : Gravité\nSC : Gravité\n1500mL à 2000mL /24h/site injection ou 1000mL/8h la nuit ou 500mL/2h","IV : Gravité\nSC : Gravité\n1500mL à 2000mL /24h/site injection ou 1000mL/8h la nuit ou 500mL/2h","IV : Gravité\nSC : Gravité\n1500mL à 2000mL /24h/site injection ou 1000mL/8h la nuit ou 500mL/2h","Administration discontinue sur voie veineuse périphérique :\nGravité 60 min","Pas de modalité alternative","Pas de modalité alternative","Pas de modalité alternative","Non Conformité : Prescription Incomplète","Conformité du mode d'administration","Non Conformité du mode d'administration / Divergence dans la prescription","Non Conformité du mode d'administration / Divergence dans la prescription"]
["ERTAPENEME","Toutes doses","ERTAPENEMEToutes doses","ERTAPENEMEToutes doses_Discontinue","Discontinue","Antiinfectieux généraux à usage systémique","Gravité 30 min","Gravité 30 min","Gravité 30 min","Gravité 30 min","Gravité 30 min",null,"Pas de modalité alternative","Pas de modalité alternative","Pas de modalité alternative",null,"Conformité du mode d'administration","Non Conformité du mode d'administration / Divergence dans la prescription","Non Conformité du mode d'administration / Divergence dans la prescription"]
["ERTAPENEME","Dose non renseignée","ERTAPENEMEDose non renseignée","ERTAPENEMEDose non renseignée_Discontinue","Discontinue","Antiinfectieux généraux à usage systémique","Gravité 30 min","Gravité 30 min","Gravité 30 min","Gravité 30 min","Gravité 30 min",null,"Pas de modalité alternative","Pas de modalité alternative","Pas de modalité alternative",null,"Conformité du mode d'administration","Non Conformité du mode d'administration / Divergence dans la prescription","Non Conformité du mode d'administration / Divergence dans la prescription"]
["GENTAMICINE","Toutes doses","GENTAMICINEToutes doses","GENTAMICINEToutes doses_Discontinue","Discontinue","Antiinfectieux généraux à usage systémique","Gravité 30 min","Gravité 30 min","Gravité 30 min","Gravité 30 min","Gravité 30 min",null,"Pas de modalité alternative","Pas de modalité alternative","Pas de modalité alternative",null,"Conformité du mode d'administration","Non Conformité du mode d'administration / Divergence dans la prescription","Non Conformité du mode d'administration / Divergence dans la prescription"]
["GENTAMICINE","Dose non renseignée","GENTAMICINEDose non renseignée","GENTAMICINEDose non renseignée_Discontinue","Discontinue","Antiinfectieux généraux à usage systémique","Gravité 30 min","Gravité 30 min","Gravité 30 min","Gravité 30 min","Gravité 30 min",null,"Pas de modalité alternative","Pas de modalité alternative","Pas de modalité alternative",null,"Conformité du mode d'administration","Non Conformité du mode d'administration / Divergence dans la prescription","Non Conformité du mode d'administration / Divergence dans la prescription"]
["HEPARINE SODIQUE","Toutes doses","HEPARINE SODIQUEToutes doses","HEPARINE SODIQUEToutes doses_Discontinue","Discontinue","Sang et organes hématopoïétique","Administration en bolus : IVD lente\nPosologie initiale et entretien : PSE","Administration en bolus : IVD lente\nPosologie initiale et entretien : PSE","Administration en bolus : IVD lente\nPosologie initiale et entretien : PSE","Administration en bolus : IVD lente\nPosologie initiale et entretien : PSE","Administration en bolus : IVD lente\nPosologie initiale et entretien : PSE",null,"Pas de modalité alternative","Pas de modalité alternative","Pas de modalité alternative",null,"Non Conformité du mode d'administration","Non Conformité du mode d'administration / Divergence dans la prescription","Conformité du mode d'administration / Divergence dans la prescription"]
["HEPARINE SODIQUE","Dose non renseignée","HEPARINE SODIQUEDose non renseignée","HEPARINE SODIQUEDose non renseignée_Discontinue","Discontinue","Sang et organes hématopoïétique","Administration en bolus : IVD lente\nPosologie initiale et entretien : PSE","Administration en bolus : IVD lente\nPosologie initiale et entretien : PSE","Administration en bolus : IVD lente\nPosologie initiale et entretien : PSE","Administration en bolus : IVD lente\nPosologie initiale et entretien : PSE","Administration en bolus : IVD lente\nPosologie initiale et entretien : PSE",null,"Pas de modalité alternative","Pas de modalité alternative","Pas de modalité alternative",null,"Non Conformité du mode d'administration","Non Conformité du mode d'administration / Divergence dans la prescription","Conformité du mode d'administration / Divergence dans la prescription"]
["HYDRATE DE CARBONE SOLUTE GLUCOSE","Toutes doses","HYDRATE DE CARBONE SOLUTE GLUCOSEToutes doses","HYDRATE DE CARBONE SOLUTE GLUCOSEToutes doses_Discontinue","Discontinue","Sang et organes hématopoïétique","IV : Gravité\nSC : Gravité\n1500mL à 2000mL /24h/site injection\nou 1000mL/8h la nuit\nou 500mL/2h","IV : Gravité\nSC : Gravité\n1500mL à 2000mL /24h/site injection\nou 1000mL/8h la nuit\nou 500mL/2h","IV : Gravité\nSC : Gravité\n1500mL à 2000mL /24h/site injection\nou 1000mL/8h la nuit\nou 500mL/2h","IV : Gravité\nSC : Gravité\n1500mL à 2000mL /24h/site injection\nou 1000mL/8h la nuit\nou 500mL/2h","IV : Gravité\nSC : Gravité\n1500mL à 2000mL /24h/site injection\nou 1000mL/8h la nuit\nou 500mL/2h",null,"Pas de modalité alternative","Pas de modalité alternative","Pas de modalité alternative",null,"Conformité du mode d'administration","Non Conformité du mode d'administration / Divergence dans la prescription","Non Conformité du mode d'administration / Divergence dans la prescription"]
["HYDRATE DE CARBONE SOLUTE GLUCOSE","Dose non renseignée","HYDRATE DE CARBONE SOLUTE GLUCOSEDose non renseignée","HYDRATE DE CARBONE SOLUTE GLUCOSEDose non renseignée_Discontinue","Discontinue","Sang et organes hématopoïétique","IV : Gravité\nSC : Gravité\n1500mL à 2000mL /24h/site injection\nou 1000mL/8h la nuit\nou 500mL/2h","IV : Gravité\nSC : Gravité\n1500mL à 2000mL /24h/site injection\nou 1000mL/8h la nuit\nou 500mL/2h","IV : Gravité\nSC : Gravité\n1500mL à 2000mL /24h/site injection\nou 1000mL/8h la nuit\nou 500mL/2h","IV : Gravité\nSC : Gravité\n1500mL à 2000mL /24h/site injection\nou 1000mL/8h la nuit\nou 500mL/2h","IV : Gravité\nSC : Gravité\n1500mL à 2000mL /24h/site injection\nou 1000mL/8h la nuit\nou 500mL/2h",null,"Pas de modalité alternative","Pas de modalité alternative","Pas de modalité alternative",null,"Conformité du mode d'administration","Non Conformité du mode d'administration / Divergence dans la prescription","Non Conformité du mode d'administration / Divergence dans la prescription"]
["HYDRATE DE CARBONE SOLUTE GLUCOSE POLYIONIQUE PRETS À L EMPLOI","Toutes doses","HYDRATE DE CARBONE SOLUTE GLUCOSE POLYIONIQUE PRETS À L EMPLOIToutes doses","HYDRATE DE CARBONE SOLUTE GLUCOSE POLYIONIQUE PRETS À L EMPLOIToutes doses_Discontinue","Discontinue","Sang et organes hématopoïétique","IV : Gravité\n1500mL à 2000mL /24h/site injection\nou 1000mL/8h la nuit\nou 500mL/2h","IV : Gravité\n1500mL à 2000mL /24h/site injection\nou 1000mL/8h la nuit\nou 500mL/2h","IV : Gravité\n1500mL à 2000mL /24h/site injection\nou 1000mL/8h la nuit\nou 500mL/2h","IV : Gravité\n1500mL à 2000mL /24h/site injection\nou 1000mL/8h la nuit\nou 500mL/2h","IV : Gravité\n1500mL à 2000mL /24h/site injection\nou 1000mL/8h la nuit\nou 500mL/2h",null,"Pas de modalité alternative","Pas de modalité alternative","Pas de modalité alternative",null,"Conformité du mode d'administration","Non Conformité du mode d'administration / Divergence dans la prescription","Non Conformité du mode d'administration / Divergence dans la prescription"]
["HYDRATE DE CARBONE SOLUTE GLUCOSE POLYIONIQUE PRETS À L EMPLOI","Dose non renseignée","HYDRATE DE CARBONE SOLUTE GLUCOSE POLYIONIQUE PRETS À L EMPLOIDose non renseignée","HYDRATE DE CARBONE SOLUTE GLUCOSE POLYIONIQUE PRETS À L EMPLOIDose non renseignée_Discontinue","Discontinue","Sang et organes hématopoïétique","IV : Gravité\n1500mL à 2000mL /24h/site injection\nou 1000mL/8h la nuit\nou 500mL/2h","IV : Gravité\n1500mL à 2000mL /24h/site injection\nou 1000mL/8h la nuit\nou 500mL/2h","IV : Gravité\n1500mL à 2000mL /24h/site injection\nou 1000mL/8h la nuit\nou 500mL/2h","IV : Gravité\n1500mL à 2000mL /24h/site injection\nou 1000mL/8h la nuit\nou 500mL/2h","IV : Gravité\n1500mL à 2000mL /24h/site injection\nou 1000mL/8h la nuit\nou 500mL/2h",null,"Pas de modalité alternative","Pas de modalité alternative","Pas de modalité alternative",null,"Conformité du mode d'administration","Non Conformité du mode d'administration / Divergence dans la prescription","Non Conformité du mode d'administration / Divergence dans la prescription"]
["IMIPENEME CILASTATINE","Toutes doses","IMIPENEME CILASTATINEToutes doses","IMIPENEME CILASTATINEToutes doses_Discontinue","Discontinue","Antiinfectieux généraux à usage systémique","Dose ≤ 500mg : Gravité 20-30 min \nDose > 500mg : Gravité 40-60 min","Dose ≤ 500mg : Gravité 20-30 min \nDose > 500mg : Gravité 40-60 min","Dose ≤ 500mg : Gravité 20-30 min \nDose > 500mg : Gravité 40-60 min","Dose ≤ 500mg : Gravité 20-30 min \nDose > 500mg : Gravité 40-60 min","Dose ≤ 500mg : Gravité 20-30 min \nDose > 500mg : Gravité 40-60 min",null,"Pas de modalité alternative","Pas de modalité alternative","Pas de modalité alternative",null,"Conformité du mode d'administration","Non Conformité du mode d'administration / Divergence dans la prescription","Non Conformité du mode d'administration / Divergence dans la prescription"]
["IMIPENEME CILASTATINE","Dose non renseignée","IMIPENEME CILASTATINEDose non renseignée","IMIPENEME CILASTATINEDose non renseignée_Discontinue","Discontinue","Antiinfectieux généraux à usage systémique","Dose ≤ 500mg : Gravité 20-30 min \nDose > 500mg : Gravité 40-60 min","Dose ≤ 500mg : Gravité 20-30 min \nDose > 500mg : Gravité 40-60 min","Dose ≤ 500mg : Gravité 20-30 min \nDose > 500mg : Gravité 40-60 min","Dose ≤ 500mg : Gravité 20-30 min \nDose > 500mg : Gravité 40-60 min","Dose ≤ 500mg : Gravité 20-30 min \nDose > 500mg : Gravité 40-60 min",null,"Pas de modalité alternative","Pas de modalité alternative","Pas de modalité alternative",null,"Conformité du mode d'administration","Non Conformité du mode d'administration / Divergence dans la prescription","Non Conformité du mode d'administration / Divergence dans la prescription"]
["IMMUNOGLOBULINES POLYVALENTES IV","Toutes doses","IMMUNOGLOBULINES POLYVALENTES IVToutes doses","IMMUNOGLOBULINES POLYVALENTES IVToutes doses_Discontinue","Discontinue","Antiinfectieux généraux à usage systémique","Pompe","Pompe","Pompe","Pompe","Pompe",null,"Pas de modalité alternative","Pas de modalité alternative","Pas de modalité alternative",null,"Non Conformité du mode d'administration","Non Conformité du mode d'administration / Divergence dans la prescription","Conformité du mode d'administration / Divergence dans la prescription"]
["IMMUNOGLOBULINES POLYVALENTES IV","Dose non renseignée","IMMUNOGLOBULINES POLYVALENTES IVDose non renseignée","IMMUNOGLOBULINES POLYVALENTES IVDose non renseignée_Discontinue","Discontinue","Antiinfectieux généraux à usage systémique","Pompe","Pompe","Pompe","Pompe","Pompe",null,"Pas de modalité alternative","Pas de modalité alternative","Pas de modalité alternative",null,"Non Conformité du mode d'administration","Non Conformité du mode d'administration / Divergence dans la prescription","Conformité du mode d'administration / Divergence dans la prescription"]
["IMMUNOGLOBULINES POLYVALENTES SC","Toutes doses","IMMUNOGLOBULINES POLYVALENTES SCToutes doses","IMMUNOGLOBULINES POLYVALENTES SCToutes doses_Discontinue","Discontinue","Antiinfectieux généraux à usage systémique","Pompe ou PSE","Pompe ou PSE","Pompe ou PSE","Pompe ou PSE","Pompe ou PSE",null,"Pas de modalité alternative","Pas de modalité alternative","Pas de modalité alternative",null,"Non Conformité du mode d'administration","Non Conformité du mode d'administration / Divergence dans la prescription","Conformité du mode d'administration / Divergence dans la prescription"]
["IMMUNOGLOBULINES POLYVALENTES SC","Dose non renseignée","IMMUNOGLOBULINES POLYVALENTES SCDose non renseignée","IMMUNOGLOBULINES POLYVALENTES SCDose non renseignée_Discontinue","Discontinue","Antiinfectieux généraux à usage systémique","Pompe ou PSE","Pompe ou PSE","Pompe ou PSE","Pompe ou PSE","Pompe ou PSE",null,"Pas de modalité alternative","Pas de modalité alternative","Pas de modalité alternative",null,"Non Conformité du mode d'administration","Non Conformité du mode d'administration / Divergence dans la prescription","Conformité du mode d'administration / Divergence dans la prescription"]
["MEDICAMENT NON INTEGRE AU GUIDE DU ResOMeDIT","Toutes doses","MEDICAMENT NON INTEGRE AU GUIDE DU ResOMeDITToutes doses","MEDICAMENT NON INTEGRE AU GUIDE DU ResOMeDITToutes doses_Discontinue","Discontinue",null,null,null,null,null,null,null,"Pas de modalité alternative","Pas de modalité alternative","Pas de modalité alternative",null,"Situation non intégrée dans le guide ResOMeDIT","Situation non intégrée dans le guide ResOMeDIT","Situation non intégrée dans le guide ResOMeDIT"]
["MEDICAMENT NON INTEGRE AU GUIDE DU ResOMeDIT","Dose non renseignée","MEDICAMENT NON INTEGRE AU GUIDE DU ResOMeDITDose non renseignée","MEDICAMENT NON INTEGRE AU GUIDE DU ResOMeDITDose non renseignée_Discontinue","Discontinue",null,null,null,null,null,null,null,"Pas de modalité alternative","Pas de modalité alternative","Pas de modalité alternative",null,"Situation non intégrée dans le guide ResOMeDIT","Situation non intégrée dans le guide ResOMeDIT","Situation non intégrée dans le guide ResOMeDIT"]
["MEROPENEME","1g","MEROPENEME1g","MEROPENEME1g_Discontinue","Discontinue","Antiinfectieux généraux à usage systémique","1gx3/j : Gravité 30 min","1gx3/j : Gravité 30 min","1gx3/j : Gravité 30 min","1gx3/j : Gravité 30 min","1gx3/j : Gravité 30 min",null,"Pas de modalité alternative","Pas de modalité alternative","Pas de modalité alternative",null,"Conformité du mode d'administration","Non Conformité du mode d'administration / Divergence dans la prescription","Non Conformité du mode d'administration / Divergence dans la prescription"]
["MEROPENEME","2g","MEROPENEME2g","MEROPENEME2g_Discontinue","Discontinue","Antiinfectieux généraux à usage systémique","2gx3/j : PSE sur 3h à 8h","2gx3/j : PSE sur 3h à 8h","2gx3/j : PSE sur 3h à 8h","2gx3/j : PSE sur 3h à 8h","2gx3/j : PSE sur 3h à 8h",null,"Pas de modalité alternative","Pas de modalité alternative","Pas de modalité alternative",null,"Non Conformité du mode d'administration","Non Conformité du mode d'administration / Divergence dans la prescription","Conformité du mode d'administration / Divergence dans la prescription"]
["MEROPENEME","Autres doses","MEROPENEMEAutres doses","MEROPENEMEAutres doses_Discontinue","Discontinue","Antiinfectieux généraux à usage systémique","1gx3/j: Gravité 30 min\n2gx3/j : PSE sur 3h à 8h","1gx3/j: Gravité 30 min\n2gx3/j : PSE sur 3h à 8h","1gx3/j: Gravité 30 min\n2gx3/j : PSE sur 3h à 8h","1gx3/j: Gravité 30 min\n2gx3/j : PSE sur 3h à 8h","1gx3/j: Gravité 30 min\n2gx3/j : PSE sur 3h à 8h",null,"Pas de modalité alternative","Pas de modalité alternative","Pas de modalité alternative",null,"Situation non intégrée dans le guide ResOMeDIT","Situation non intégrée dans le guide ResOMeDIT","Situation non intégrée dans le guide ResOMeDIT"]
["MEROPENEME","Dose non renseignée","MEROPENEMEDose non renseignée","MEROPENEMEDose non renseignée_Discontinue","Discontinue","Antiinfectieux généraux à usage systémique","1gx3/j: Gravité 30 min\n2gx3/j : PSE sur 3h à 8h","1gx3/j: Gravité 30 min\n2gx3/j : PSE sur 3h à 8h","1gx3/j: Gravité 30 min\n2gx3/j : PSE sur 3h à 8h","1gx3/j: Gravité 30 min\n2gx3/j : PSE sur 3h à 8h","1gx3/j: Gravité 30 min\n2gx3/j : PSE sur 3h à 8h",null,"Pas de modalité alternative","Pas de modalité alternative","Pas de modalité alternative",null,"Non conformité : Prescription incomplète","Non conformité : Prescription incomplète","Non conformité : Prescription incomplète"]
["METHYLPREDNISOLONE","Toutes doses","METHYLPREDNISOLONEToutes doses","METHYLPREDNISOLONEToutes doses_Discontinue","Discontinue","Hormones systémiquess","Gravité 20-30 min","Gravité 20-30 min","Gravité 20-30 min","Gravité 20-30 min","Gravité 20-30 min",null,"Pas de modalité alternative","Pas de modalité alternative","Pas de modalité alternative",null,"Conformité du mode d'administration","Non Conformité du mode d'administration / Divergence dans la prescription","Non Conformité du mode d'administration / Divergence dans la prescription"]
["METHYLPREDNISOLONE","Dose non renseignée","METHYLPREDNISOLONEDose non renseignée","METHYLPREDNISOLONEDose non renseignée_Discontinue","Discontinue","Hormones systémiquess","Gravité 20-30 min","Gravité 20-30 min","Gravité 20-30 min","Gravité 20-30 min","Gravité 20-30 min",null,"Pas de modalité alternative","Pas de modalité alternative","Pas de modalité alternative",null,"Conformité du mode d'administration","Non Conformité du mode d'administration / Divergence dans la prescription","Non Conformité du mode d'administration / Divergence dans la prescription"]
["MIDAZOLAM","Toutes doses","MIDAZOLAMToutes doses","MIDAZOLAMToutes doses_Discontinue","Discontinue","Système nerveux","Administration en bolus : IVD lente\nAdministration en continu : PSE","Administration en bolus : IVD lente\nAdministration en continu : PSE","Administration en bolus : IVD lente\nAdministration en continu : PSE","Administration en bolus : IVD lente\nAdministration en continu : PSE","Administration en bolus : IVD lente\nAdministration en continu : PSE",null,"Pas de modalité alternative","Pas de modalité alternative","Pas de modalité alternative",null,"Non Conformité du mode d'administration","Non Conformité du mode d'administration / Divergence dans la prescription","Conformité du mode d'administration / Divergence dans la prescription"]
["MIDAZOLAM","Dose non renseignée","MIDAZOLAMDose non renseignée","MIDAZOLAMDose non renseignée_Discontinue","Discontinue","Système nerveux","Administration en bolus : IVD lente\nAdministration en continu : PSE","Administration en bolus : IVD lente\nAdministration en continu : PSE","Administration en bolus : IVD lente\nAdministration en continu : PSE","Administration en bolus : IVD lente\nAdministration en continu : PSE","Administration en bolus : IVD lente\nAdministration en continu : PSE",null,"Pas de modalité alternative","Pas de modalité alternative","Pas de modalité alternative",null,"Non Conformité du mode d'administration","Non Conformité du mode d'administration / Divergence dans la prescription","Conformité du mode d'administration / Divergence dans la prescription"]
["MORPHINE","Toutes doses","MORPHINEToutes doses","MORPHINEToutes doses_Discontinue","Discontinue","Système nerveux","Pompe PCA ","Pompe PCA ","Pompe PCA ","Pompe PCA ","Pompe PCA ",null,"Pas de modalité alternative","Pas de modalité alternative","Pas de modalité alternative",null,"Non Conformité du mode d'administration","Non Conformité du mode d'administration / Divergence dans la prescription","Conformité du mode d'administration / Divergence dans la prescription"]
["MORPHINE","Dose non renseignée","MORPHINEDose non renseignée","MORPHINEDose non renseignée_Discontinue","Discontinue","Système nerveux","Pompe PCA ","Pompe PCA ","Pompe PCA ","Pompe PCA ","Pompe PCA ",null,"Pas de modalité alternative","Pas de modalité alternative","Pas de modalité alternative",null,"Non Conformité du mode d'administration","Non Conformité du mode d'administration / Divergence dans la prescription","Conformité du mode d'administration / Divergence dans la prescription"]
["NEFOPAM","Toutes doses","NEFOPAMToutes doses","NEFOPAMToutes doses_Discontinue","Discontinue","Système nerveux","Gravité 15 à 30 min","Gravité 15 à 30 min","Gravité 15 à 30 min","Gravité 15 à 30 min","Gravité 15 à 30 min",null,"Diffuseur","Pas d'autre modalité alternative","Diffuseur",null,"Conformité du mode d'administration","Modalité alternative d'administration / Divergence dans la prescription","Non Conformité du mode d'administration / Divergence dans la prescription"]
["NEFOPAM","Dose non renseignée","NEFOPAMDose non renseignée","NEFOPAMDose non renseignée_Discontinue","Discontinue","Système nerveux","Gravité 15 à 30 min","Gravité 15 à 30 min","Gravité 15 à 30 min","Gravité 15 à 30 min","Gravité 15 à 30 min",null,"Diffuseur","Pas d'autre modalité alternative","Diffuseur",null,"Conformité du mode d'administration","Modalité alternative d'administration / Divergence dans la prescription","Non Conformité du mode d'administration / Divergence dans la prescription"]
["OXACILLINE","Toutes doses","OXACILLINEToutes doses","OXACILLINEToutes doses_Discontinue","Discontinue","Antiinfectieux généraux à usage systémique","Perfusion continue : Diffuseur sur 8h (respecter la Cmax)","Perfusion continue : Diffuseur sur 8h (respecter la Cmax)","Perfusion continue : Diffuseur sur 8h (respecter la Cmax)","Perfusion continue : Diffuseur sur 8h (respecter la Cmax)","Perfusion continue : Diffuseur sur 8h (respecter la Cmax)",null,"Pas d'autre modalité alternative","Administration discontinue : Gravité 30 à 60 min","Administration discontinue : Gravité 30 à 60 min",null,"Modalité alternative d'administration","Conformité du mode d'administration / Divergence dans la prescription","Non Conformité du mode d'administration / Divergence dans la prescription"]
["OXACILLINE","Dose non renseignée","OXACILLINEDose non renseignée","OXACILLINEDose non renseignée_Discontinue","Discontinue","Antiinfectieux généraux à usage systémique","Perfusion continue : Diffuseur sur 8h (respecter la Cmax)","Perfusion continue : Diffuseur sur 8h (respecter la Cmax)","Perfusion continue : Diffuseur sur 8h (respecter la Cmax)","Perfusion continue : Diffuseur sur 8h (respecter la Cmax)","Perfusion continue : Diffuseur sur 8h (respecter la Cmax)",null,"Pas d'autre modalité alternative","Administration discontinue : Gravité 30 à 60 min","Administration discontinue : Gravité 30 à 60 min",null,"Modalité alternative d'administration","Conformité du mode d'administration / Divergence dans la prescription","Non Conformité du mode d'administration / Divergence dans la prescription"]
["OXYCODONE","Toutes doses","OXYCODONEToutes doses","OXYCODONEToutes doses_Discontinue","Discontinue","Système nerveux","Pompe PCA","Pompe PCA","Pompe PCA","Pompe PCA","Pompe PCA",null,"Pas de modalité alternative","Pas de modalité alternative","Pas de modalité alternative",null,"Non Conformité du mode d'administration","Non Conformité du mode d'administration / Divergence dans la prescription","Conformité du mode d'administration / Divergence dans la prescription"]
["OXYCODONE","Dose non renseignée","OXYCODONEDose non renseignée","OXYCODONEDose non renseignée_Discontinue","Discontinue","Système nerveux","Pompe PCA","Pompe PCA","Pompe PCA","Pompe PCA","Pompe PCA",null,"Pas de modalité alternative","Pas de modalité alternative","Pas de modalité alternative",null,"Non Conformité du mode d'administration","Non Conformité du mode d'administration / Divergence dans la prescription","Conformité du mode d'administration / Divergence dans la prescription"]
["PIPERACILLINE-TAZOBACTAM","Toutes doses","PIPERACILLINE-TAZOBACTAMToutes doses","PIPERACILLINE-TAZOBACTAMToutes doses_Discontinue","Discontinue","Antiinfectieux généraux à usage systémique","En cas d'administration discontinue : Gravité 30 min\nEn cas de perfusion continue : Diffuseur sur 24h (respecter la Cmax)","En cas d'administration discontinue : Gravité 30 min\nEn cas de perfusion continue : Diffuseur sur 24h (respecter la Cmax)","En cas d'administration discontinue : Gravité 30 min\nEn cas de perfusion continue : Diffuseur sur 24h (respecter la Cmax)","En cas d'administration discontinue : Gravité 30 min\nEn cas de perfusion continue : Diffuseur sur 24h (respecter la Cmax)","En cas d'administration discontinue : Gravité 30 min\nEn cas de perfusion continue : Diffuseur sur 24h (respecter la Cmax)",null,"Pas de modalité alternative","Pas de modalité alternative","Pas de modalité alternative",null,"Conformité du mode d'administration","Conformité du mode d'administration / Divergence dans la prescription","Non Conformité du mode d'administration / Divergence dans la prescription"]
["PIPERACILLINE-TAZOBACTAM","Dose non renseignée","PIPERACILLINE-TAZOBACTAMDose non renseignée","PIPERACILLINE-TAZOBACTAMDose non renseignée_Discontinue","Discontinue","Antiinfectieux généraux à usage systémique","En cas d'administration discontinue : Gravité 30 min\nEn cas de perfusion continue : Diffuseur sur 24h (respecter la Cmax)","En cas d'administration discontinue : Gravité 30 min\nEn cas de perfusion continue : Diffuseur sur 24h (respecter la Cmax)","En cas d'administration discontinue : Gravité 30 min\nEn cas de perfusion continue : Diffuseur sur 24h (respecter la Cmax)","En cas d'administration discontinue : Gravité 30 min\nEn cas de perfusion continue : Diffuseur sur 24h (respecter la Cmax)","En cas d'administration discontinue : Gravité 30 min\nEn cas de perfusion continue : Diffuseur sur 24h (respecter la Cmax)",null,"Pas de modalité alternative","Pas de modalité alternative","Pas de modalité alternative",null,"Conformité du mode d'administration","Conformité du mode d'administration / Divergence dans la prescription","Non Conformité du mode d'administration / Divergence dans la prescription"]
["ROPIVACAINE","Toutes doses","ROPIVACAINEToutes doses","ROPIVACAINEToutes doses_Discontinue","Discontinue","Système nerveux","Pompe PCA ou Diffuseur","Pompe PCA ou Diffuseur","Pompe PCA ou Diffuseur","Pompe PCA ou Diffuseur","Pompe PCA ou Diffuseur",null,"Pas de modalité alternative","Pas de modalité alternative","Pas de modalité alternative",null,"Non Conformité du mode d'administration","Conformité du mode d'administration / Divergence dans la prescription","Conformité du mode d'administration / Divergence dans la prescription"]
["ROPIVACAINE","Dose non renseignée","ROPIVACAINEDose non renseignée","ROPIVACAINEDose non renseignée_Discontinue","Discontinue","Système nerveux","Pompe PCA ou Diffuseur","Pompe PCA ou Diffuseur","Pompe PCA ou Diffuseur","Pompe PCA ou Diffuseur","Pompe PCA ou Diffuseur",null,"Pas de modalité alternative","Pas de modalité alternative","Pas de modalité alternative",null,"Non Conformité du mode d'administration","Conformité du mode d'administration / Divergence dans la prescription","Conformité du mode d'administration / Divergence dans la prescription"]
["TEICOPLANINE","Toutes doses","TEICOPLANINEToutes doses","TEICOPLANINEToutes doses_Discontinue","Discontinue","Antiinfectieux généraux à usage systémique","Gravité 30 min","Gravité 30 min","Gravité 30 min","Gravité 30 min","Gravité 30 min",null,"Pas de modalité alternative","Pas de modalité alternative","Pas de modalité alternative",null,"Conformité du mode d'administration","Non Conformité du mode d'administration / Divergence dans la prescription","Non Conformité du mode d'administration / Divergence dans la prescription"]
["TEICOPLANINE","Dose non renseignée","TEICOPLANINEDose non renseignée","TEICOPLANINEDose non renseignée_Discontinue","Discontinue","Antiinfectieux généraux à usage systémique","Gravité 30 min","Gravité 30 min","Gravité 30 min","Gravité 30 min","Gravité 30 min",null,"Pas de modalité alternative","Pas de modalité alternative","Pas de modalité alternative",null,"Conformité du mode d'administration","Non Conformité du mode d'administration / Divergence dans la prescription","Non Conformité du mode d'administration / Divergence dans la prescription"]
["TEMOCILLINE","Toutes doses","TEMOCILLINEToutes doses","TEMOCILLINEToutes doses_Discontinue","Discontinue","Antiinfectieux généraux à usage systémique","Perfusion continue : Diffuseur sur 24 h (respecter Cmax)\nAdministration discontinue : Gravité 30 min","Perfusion continue : Diffuseur sur 24 h (respecter Cmax)\nAdministration discontinue : Gravité 30 min","Perfusion continue : Diffuseur sur 24 h (respecter Cmax)\nAdministration discontinue : Gravité 30 min","Perfusion continue : Diffuseur sur 24 h (respecter Cmax)\nAdministration discontinue : Gravité 30 min","Perfusion continue : Diffuseur sur 24 h (respecter Cmax)\nAdministration discontinue : Gravité 30 min",null,"Pas de modalité alternative","Pas de modalité alternative","Pas de modalité alternative",null,"Conformité du mode d'administration","Conformité du mode d'administration / Divergence dans la prescription","Non Conformité du mode d'administration / Divergence dans la prescription"]
["TEMOCILLINE","Dose non renseignée","TEMOCILLINEDose non renseignée","TEMOCILLINEDose non renseignée_Discontinue","Discontinue","Antiinfectieux généraux à usage systémique","Perfusion continue : Diffuseur sur 24 h (respecter Cmax)\nAdministration discontinue : Gravité 30 min","Perfusion continue : Diffuseur sur 24 h (respecter Cmax)\nAdministration discontinue : Gravité 30 min","Perfusion continue : Diffuseur sur 24 h (respecter Cmax)\nAdministration discontinue : Gravité 30 min","Perfusion continue : Diffuseur sur 24 h (respecter Cmax)\nAdministration discontinue : Gravité 30 min","Perfusion continue : Diffuseur sur 24 h (respecter Cmax)\nAdministration discontinue : Gravité 30 min",null,"Pas de modalité alternative","Pas de modalité alternative","Pas de modalité alternative",null,"Conformité du mode d'administration","Conformité du mode d'administration / Divergence dans la prescription","Non Conformité du mode d'administration / Divergence dans la prescription"]
["TOBRAMYCINE","Toutes doses","TOBRAMYCINEToutes doses","TOBRAMYCINEToutes doses_Discontinue","Discontinue","Antiinfectieux généraux à usage systémique","Gravité 30 min","Gravité 30 min","Gravité 30 min","Gravité 30 min","Gravité 30 min",null,"Pas de modalité alternative","Pas de modalité alternative","Pas de modalité alternative",null,"Conformité du mode d'administration","Non Conformité du mode d'administration / Divergence dans la prescription","Non Conformité du mode d'administration / Divergence dans la prescription"]
["TOBRAMYCINE","Dose non renseignée","TOBRAMYCINEDose non renseignée","TOBRAMYCINEDose non renseignée_Discontinue","Discontinue","Antiinfectieux généraux à usage systémique","Gravité 30 min","Gravité 30 min","Gravité 30 min","Gravité 30 min","Gravité 30 min",null,"Pas de modalité alternative","Pas de modalité alternative","Pas de modalité alternative",null,"Conformité du mode d'administration","Non Conformité du mode d'administration / Divergence dans la prescription","Non Conformité du mode d'administration / Divergence dans la prescription"]
["VANCOMYCINE","Toutes doses","VANCOMYCINEToutes doses","VANCOMYCINEToutes doses_Discontinue","Discontinue","Antiinfectieux généraux à usage systémique","Perfusion continue sur voie veineuse centrale : Diffuseur sur 24h (respecter Cmax)","Perfusion continue sur voie veineuse centrale : Diffuseur sur 24h (respecter Cmax)","Perfusion continue sur voie veineuse centrale : Diffuseur sur 24h (respecter Cmax)","Perfusion continue sur voie veineuse centrale : Diffuseur sur 24h (respecter Cmax)","Perfusion continue sur voie veineuse centrale : Diffuseur sur 24h (respecter Cmax)",null,"Pas d'autre modalité alternative","Administration discontinue sur voie veineuse périphérique : Gravité 60 min","Administration discontinue sur voie veineuse périphérique : Gravité 60 min",null,"Modalité alternative d'administration","Conformité du mode d'administration / Divergence dans la prescription","Non Conformité du mode d'administration / Divergence dans la prescription"]
["VANCOMYCINE","Dose non renseignée","VANCOMYCINEDose non renseignée","VANCOMYCINEDose non renseignée_Discontinue","Discontinue","Antiinfectieux généraux à usage systémique","Perfusion continue sur voie veineuse centrale : Diffuseur sur 24h (respecter Cmax)","Perfusion continue sur voie veineuse centrale : Diffuseur sur 24h (respecter Cmax)","Perfusion continue sur voie veineuse centrale : Diffuseur sur 24h (respecter Cmax)","Perfusion continue sur voie veineuse centrale : Diffuseur sur 24h (respecter Cmax)","Perfusion continue sur voie veineuse centrale : Diffuseur sur 24h (respecter Cmax)",null,"Pas d'autre modalité alternative","Administration discontinue sur voie veineuse périphérique : Gravité 60 min","Administration discontinue sur voie veineuse périphérique : Gravité 60 min",null,"Modalité alternative d'administration","Conformité du mode d'administration / Divergence dans la prescription","Non Conformité du mode d'administration / Divergence dans la prescription"]
["5 FU","Toutes doses","5 FUToutes doses","5 FUToutes doses_NP","NP","Antinéoplasiques et immunomodulateurs","Diffuseur\r","Diffuseur\r","Diffuseur\r","Diffuseur\r","Diffuseur\r",null,"Pas de modalité alternative","Pas de modalité alternative","Pas de modalité alternative",null,"Non Conformité du mode d'administration","Conformité du mode d'administration","Non Conformité du mode d'administration"]
["5 FU","Dose non renseignée","5 FUDose non renseignée","5 FUDose non renseignée_NP","NP","Antinéoplasiques et immunomodulateurs","Diffuseur\r","Diffuseur\r","Diffuseur\r","Diffuseur\r","Diffuseur\r",null,"Pas de modalité alternative","Pas de modalité alternative","Pas de modalité alternative",null,"Non Conformité du mode d'administration","Conformité du mode d'administration","Non Conformité du mode d'administration"]
["ACIDE ZOLEDRONIQUE","Toutes doses","ACIDE ZOLEDRONIQUEToutes doses","ACIDE ZOLEDRONIQUEToutes doses_NP","NP","Muscle et squelette","Gravité 15-30 min","Gravité 15-30 min","Gravité 15-30 min","Gravité 15-30 min","Gravité 15-30 min",null,"Pas de modalité alternative","Pas de modalité alternative","Pas de modalité alternative",null,"Conformité du mode d'administration","Non Conformité du mode d'administration","Non Conformité du mode d'administration"]
["ACIDE ZOLEDRONIQUE","Dose non renseignée","ACIDE ZOLEDRONIQUEDose non renseignée","ACIDE ZOLEDRONIQUEDose non renseignée_NP","NP","Muscle et squelette","Gravité 15-30 min","Gravité 15-30 min","Gravité 15-30 min","Gravité 15-30 min","Gravité 15-30 min",null,"Pas de modalité alternative","Pas de modalité alternative","Pas de modalité alternative",null,"Conformité du mode d'administration","Non Conformité du mode d'administration","Non Conformité du mode d'administration"]
["AMIKACINE","Toutes doses","AMIKACINEToutes doses","AMIKACINEToutes doses_NP","NP","Antiinfectieux généraux à usage systémique","Gravité 30 min","Gravité 30 min","Gravité 30 min","Gravité 30 min","Gravité 30 min",null,"Pas de modalité alternative","Pas de modalité alternative","Pas de modalité alternative",null,"Conformité du mode d'administration","Non Conformité du mode d'administration","Non Conformité du mode d'administration"]
["AMIKACINE","Dose non renseignée","AMIKACINEDose non renseignée","AMIKACINEDose non renseignée_NP","NP","Antiinfectieux généraux à usage systémique","Gravité 30 min","Gravité 30 min","Gravité 30 min","Gravité 30 min","Gravité 30 min",null,"Pas de modalité alternative","Pas de modalité alternative","Pas de modalité alternative",null,"Conformité du mode d'administration","Non Conformité du mode d'administration","Non Conformité du mode d'administration"]
["AMOXICILLINE","Toutes doses","AMOXICILLINEToutes doses","AMOXICILLINEToutes doses_NP","NP","Antiinfectieux généraux à usage systémique","Administration discontinue : Gravité 30 min\nPerfusion continue et en fonction de la mobilité du patient : Diffuseur sur 12H (respecter la Cmax)","Administration discontinue : Gravité 30 min\nPerfusion continue et en fonction de la mobilité du patient : Diffuseur sur 12H (respecter la Cmax)","Administration discontinue : Gravité 30 min\nPerfusion continue et en fonction de la mobilité du patient : Diffuseur sur 12H (respecter la Cmax)","Administration discontinue : Gravité 30 min\nPerfusion continue et en fonction de la mobilité du patient : Diffuseur sur 12H (respecter la Cmax)","Administration discontinue : Gravité 30 min\nPerfusion continue et en fonction de la mobilité du patient : Diffuseur sur 12H (respecter la Cmax)",null,"Pas de modalité alternative","Pas de modalité alternative","Pas de modalité alternative",null,"Conformité du mode d'administration","Conformité du mode d'administration","Non Conformité du mode d'administration"]
["AMOXICILLINE","Dose non renseignée","AMOXICILLINEDose non renseignée","AMOXICILLINEDose non renseignée_NP","NP","Antiinfectieux généraux à usage systémique","Administration discontinue : Gravité 30 min\nPerfusion continue et en fonction de la mobilité du patient : Diffuseur sur 12H (respecter la Cmax)","Administration discontinue : Gravité 30 min\nPerfusion continue et en fonction de la mobilité du patient : Diffuseur sur 12H (respecter la Cmax)","Administration discontinue : Gravité 30 min\nPerfusion continue et en fonction de la mobilité du patient : Diffuseur sur 12H (respecter la Cmax)","Administration discontinue : Gravité 30 min\nPerfusion continue et en fonction de la mobilité du patient : Diffuseur sur 12H (respecter la Cmax)","Administration discontinue : Gravité 30 min\nPerfusion continue et en fonction de la mobilité du patient : Diffuseur sur 12H (respecter la Cmax)",null,"Pas de modalité alternative","Pas de modalité alternative","Pas de modalité alternative",null,"Conformité du mode d'administration","Conformité du mode d'administration","Non Conformité du mode d'administration"]
["AMOXICILLINE ACIDE CLAVULANIQUE","Toutes doses","AMOXICILLINE ACIDE CLAVULANIQUEToutes doses","AMOXICILLINE ACIDE CLAVULANIQUEToutes doses_NP","NP","Antiinfectieux généraux à usage systémique","Gravité 30 min","Gravité 30 min","Gravité 30 min","Gravité 30 min","Gravité 30 min",null,"Pas de modalité alternative","Pas de modalité alternative","Pas de modalité alternative",null,"Conformité du mode d'administration","Non Conformité du mode d'administration","Non Conformité du mode d'administration"]
["AMOXICILLINE ACIDE CLAVULANIQUE","Dose non renseignée","AMOXICILLINE ACIDE CLAVULANIQUEDose non renseignée","AMOXICILLINE ACIDE CLAVULANIQUEDose non renseignée_NP","NP","Antiinfectieux généraux à usage systémique","Gravité 30 min","Gravité 30 min","Gravité 30 min","Gravité 30 min","Gravité 30 min",null,"Pas de modalité alternative","Pas de modalité alternative","Pas de modalité alternative",null,"Conformité du mode d'administration","Non Conformité du mode d'administration","Non Conformité du mode d'administration"]
["AMPHOTERICINE B FUNGIZONE","Toutes doses","AMPHOTERICINE B FUNGIZONEToutes doses","AMPHOTERICINE B FUNGIZONEToutes doses_NP","NP","Antiinfectieux généraux à usage systémique","Dose test : IV lente (20-30 minutes)\nPompe administration en 2 à 6h","Dose test : IV lente (20-30 minutes)\nPompe administration en 2 à 6h","Dose test : IV lente (20-30 minutes)\nPompe administration en 2 à 6h","Dose test : IV lente (20-30 minutes)\nPompe administration en 2 à 6h","Dose test : IV lente (20-30 minutes)\nPompe administration en 2 à 6h",null,"Pas d'autre modalité alternative","Gravité 2 à 6 heures si envisageable","Gravité 2 à 6 heures si envisageable",null,"Modalité alternative d'administration","Non Conformité du mode d'administration","Conformité du mode d'administration"]
["AMPHOTERICINE B FUNGIZONE","Dose non renseignée","AMPHOTERICINE B FUNGIZONEDose non renseignée","AMPHOTERICINE B FUNGIZONEDose non renseignée_NP","NP","Antiinfectieux généraux à usage systémique","Dose test : IV lente (20-30 minutes)\nPompe administration en 2 à 6h","Dose test : IV lente (20-30 minutes)\nPompe administration en 2 à 6h","Dose test : IV lente (20-30 minutes)\nPompe administration en 2 à 6h","Dose test : IV lente (20-30 minutes)\nPompe administration en 2 à 6h","Dose test : IV lente (20-30 minutes)\nPompe administration en 2 à 6h",null,"Pas d'autre modalité alternative","Gravité 2 à 6 heures si envisageable","Gravité 2 à 6 heures si envisageable",null,"Modalité alternative d'administration","Non Conformité du mode d'administration","Conformité du mode d'administration"]
["AMPHOTERICINE B LIPOSOMALE AMBISOME","Toutes doses","AMPHOTERICINE B LIPOSOMALE AMBISOMEToutes doses","AMPHOTERICINE B LIPOSOMALE AMBISOMEToutes doses_NP","NP","Antiinfectieux généraux à usage systémique","Gravité 30-60 min (prolonger la durée si perfusion mal tolérée)","Gravité 30-60 min (prolonger la durée si perfusion mal tolérée)","Gravité 30-60 min (prolonger la durée si perfusion mal tolérée)","Gravité 30-60 min (prolonger la durée si perfusion mal tolérée)","Gravité 30-60 min (prolonger la durée si perfusion mal tolérée)",null,"Pompe (si perfusion de 2 à 4 heures en cas de posologie supérieure à 3mg/kg/j)","Pompe (si perfusion de 2 à 4 heures en cas de posologie supérieure à 3mg/kg/j)","Pas d'autre modalité alternative",null,"Conformité du mode d'administration","Non Conformité du mode d'administration","Modalité alternative d'administration"]
["AMPHOTERICINE B LIPOSOMALE AMBISOME","Dose non renseignée","AMPHOTERICINE B LIPOSOMALE AMBISOMEDose non renseignée","AMPHOTERICINE B LIPOSOMALE AMBISOMEDose non renseignée_NP","NP","Antiinfectieux généraux à usage systémique","Gravité 30-60 min (prolonger la durée si perfusion mal tolérée)","Gravité 30-60 min (prolonger la durée si perfusion mal tolérée)","Gravité 30-60 min (prolonger la durée si perfusion mal tolérée)","Gravité 30-60 min (prolonger la durée si perfusion mal tolérée)","Gravité 30-60 min (prolonger la durée si perfusion mal tolérée)",null,"Pompe (si perfusion de 2 à 4 heures en cas de posologie supérieure à 3mg/kg/j)","Pompe (si perfusion de 2 à 4 heures en cas de posologie supérieure à 3mg/kg/j)","Pas d'autre modalité alternative",null,"Conformité du mode d'administration","Non Conformité du mode d'administration","Modalité alternative d'administration"]
["APOMORPHINE","Toutes doses","APOMORPHINEToutes doses","APOMORPHINEToutes doses_NP","NP","Système nerveux","Pompe ou PSE","Pompe ou PSE","Pompe ou PSE","Pompe ou PSE","Pompe ou PSE",null,"Pas de modalité alternative","Pas de modalité alternative","Pas de modalité alternative",null,"Non Conformité du mode d'administration","Non Conformité du mode d'administration","Conformité du mode d'administration"]
["APOMORPHINE","Dose non renseignée","APOMORPHINEDose non renseignée","APOMORPHINEDose non renseignée_NP","NP","Système nerveux","Pompe ou PSE","Pompe ou PSE","Pompe ou PSE","Pompe ou PSE","Pompe ou PSE",null,"Pas de modalité alternative","Pas de modalité alternative","Pas de modalité alternative",null,"Non Conformité du mode d'administration","Non Conformité du mode d'administration","Conformité du mode d'administration"]
["AZTREONAM","Toutes doses","AZTREONAMToutes doses","AZTREONAMToutes doses_NP","NP","Antiinfectieux généraux à usage systémique","Perfusion continue : Diffuseur sur 24h (respecter Cmax)\nAdministration discontinue : Gravité 30 min","Perfusion continue : Diffuseur sur 24h (respecter Cmax)\nAdministration discontinue : Gravité 30 min","Perfusion continue : Diffuseur sur 24h (respecter Cmax)\nAdministration discontinue : Gravité 30 min","Perfusion continue : Diffuseur sur 24h (respecter Cmax)\nAdministration discontinue : Gravité 30 min","Perfusion continue : Diffuseur sur 24h (respecter Cmax)\nAdministration discontinue : Gravité 30 min",null,"Pas de modalité alternative","Pas de modalité alternative","Pas de modalité alternative",null,"Conformité du mode d'administration","Conformité du mode d'administration","Non Conformité du mode d'administration"]
["AZTREONAM","Dose non renseignée","AZTREONAMDose non renseignée","AZTREONAMDose non renseignée_NP","NP","Antiinfectieux généraux à usage systémique","Perfusion continue : Diffuseur sur 24h (respecter Cmax)\nAdministration discontinue : Gravité 30 min","Perfusion continue : Diffuseur sur 24h (respecter Cmax)\nAdministration discontinue : Gravité 30 min","Perfusion continue : Diffuseur sur 24h (respecter Cmax)\nAdministration discontinue : Gravité 30 min","Perfusion continue : Diffuseur sur 24h (respecter Cmax)\nAdministration discontinue : Gravité 30 min","Perfusion continue : Diffuseur sur 24h (respecter Cmax)\nAdministration discontinue : Gravité 30 min",null,"Pas de modalité alternative","Pas de modalité alternative","Pas de modalité alternative",null,"Conformité du mode d'administration","Conformité du mode d'administration","Non Conformité du mode d'administration"]
["BETAMETHASONE","Toutes doses","BETAMETHASONEToutes doses","BETAMETHASONEToutes doses_NP","NP","Hormones systémiquess","Gravité 15-30 min","Gravité 15-30 min","Gravité 15-30 min","Gravité 15-30 min","Gravité 15-30 min",null,"Pas de modalité alternative","Pas de modalité alternative","Pas de modalité alternative",null,"Conformité du mode d'administration","Non Conformité du mode d'administration","Non Conformité du mode d'administration"]
["BETAMETHASONE","Dose non renseignée","BETAMETHASONEDose non renseignée","BETAMETHASONEDose non renseignée_NP","NP","Hormones systémiquess","Gravité 15-30 min","Gravité 15-30 min","Gravité 15-30 min","Gravité 15-30 min","Gravité 15-30 min",null,"Pas de modalité alternative","Pas de modalité alternative","Pas de modalité alternative",null,"Conformité du mode d'administration","Non Conformité du mode d'administration","Non Conformité du mode d'administration"]
["CASPOFUNGINE","Toutes doses","CASPOFUNGINEToutes doses","CASPOFUNGINEToutes doses_NP","NP","Antiinfectieux généraux à usage systémique","Gravité 60 min","Gravité 60 min","Gravité 60 min","Gravité 60 min","Gravité 60 min",null,"En cas de mobilité du patient :\n50mg : Diffuseur vol mini 100 mL 60 min\n70mg : Diffuseur vol mini 250 mL 60 min","Pas d'autre modalité alternative","En cas de mobilité du patient :\n50mg : Diffuseur vol mini 100 mL 60 min\n70mg : Diffuseur vol mini 250 mL 60 min",null,"Conformité du mode d'administration","Modalité alternative d'administration","Non Conformité du mode d'administration"]
["CASPOFUNGINE","Dose non renseignée","CASPOFUNGINEDose non renseignée","CASPOFUNGINEDose non renseignée_NP","NP","Antiinfectieux généraux à usage systémique","Gravité 60 min","Gravité 60 min","Gravité 60 min","Gravité 60 min","Gravité 60 min",null,"En cas de mobilité du patient :\n50mg : Diffuseur vol mini 100 mL 60 min\n70mg : Diffuseur vol mini 250 mL 60 min","Pas d'autre modalité alternative","En cas de mobilité du patient :\n50mg : Diffuseur vol mini 100 mL 60 min\n70mg : Diffuseur vol mini 250 mL 60 min",null,"Conformité du mode d'administration","Modalité alternative d'administration","Non Conformité du mode d'administration"]
["CEFEPIME","Toutes doses","CEFEPIMEToutes doses","CEFEPIMEToutes doses_NP","NP","Antiinfectieux généraux à usage systémique","Perfusion continue : Diffuseur sur 12h (respecter la Cmax)\nAdministration discontinue : Gravité 30 min","Perfusion continue : Diffuseur sur 12h (respecter la Cmax)\nAdministration discontinue : Gravité 30 min","Perfusion continue : Diffuseur sur 12h (respecter la Cmax)\nAdministration discontinue : Gravité 30 min","Perfusion continue : Diffuseur sur 12h (respecter la Cmax)\nAdministration discontinue : Gravité 30 min","Perfusion continue : Diffuseur sur 12h (respecter la Cmax)\nAdministration discontinue : Gravité 30 min",null,"Pas de modalité alternative","Pas de modalité alternative","Pas de modalité alternative",null,"Conformité du mode d'administration","Conformité du mode d'administration","Non Conformité du mode d'administration"]
["CEFEPIME","Dose non renseignée","CEFEPIMEDose non renseignée","CEFEPIMEDose non renseignée_NP","NP","Antiinfectieux généraux à usage systémique","Perfusion continue : Diffuseur sur 12h (respecter la Cmax)\nAdministration discontinue : Gravité 30 min","Perfusion continue : Diffuseur sur 12h (respecter la Cmax)\nAdministration discontinue : Gravité 30 min","Perfusion continue : Diffuseur sur 12h (respecter la Cmax)\nAdministration discontinue : Gravité 30 min","Perfusion continue : Diffuseur sur 12h (respecter la Cmax)\nAdministration discontinue : Gravité 30 min","Perfusion continue : Diffuseur sur 12h (respecter la Cmax)\nAdministration discontinue : Gravité 30 min",null,"Pas de modalité alternative","Pas de modalité alternative","Pas de modalité alternative",null,"Conformité du mode d'administration","Conformité du mode d'administration","Non Conformité du mode d'administration"]
["CEFOXITINE","Toutes doses","CEFOXITINEToutes doses","CEFOXITINEToutes doses_NP","NP","Antiinfectieux généraux à usage systémique","Perfusion continue : Diffuseur sur 12h (respecter la Cmax)","Perfusion continue : Diffuseur sur 12h (respecter la Cmax)","Perfusion continue : Diffuseur sur 12h (respecter la Cmax)","Perfusion continue : Diffuseur sur 12h (respecter la Cmax)","Perfusion continue : Diffuseur sur 12h (respecter la Cmax)",null,"Pas de modalité alternative","Pas de modalité alternative","Pas de modalité alternative",null,"Non Conformité du mode d'administration","Conformité du mode d'administration","Non Conformité du mode d'administration"]
["CEFOXITINE","Dose non renseignée","CEFOXITINEDose non renseignée","CEFOXITINEDose non renseignée_NP","NP","Antiinfectieux généraux à usage systémique","Perfusion continue : Diffuseur sur 12h (respecter la Cmax)","Perfusion continue : Diffuseur sur 12h (respecter la Cmax)","Perfusion continue : Diffuseur sur 12h (respecter la Cmax)","Perfusion continue : Diffuseur sur 12h (respecter la Cmax)","Perfusion continue : Diffuseur sur 12h (respecter la Cmax)",null,"Pas de modalité alternative","Pas de modalité alternative","Pas de modalité alternative",null,"Non Conformité du mode d'administration","Conformité du mode d'administration","Non Conformité du mode d'administration"]
["CEFTAZIDIME","Toutes doses","CEFTAZIDIMEToutes doses","CEFTAZIDIMEToutes doses_NP","NP","Antiinfectieux généraux à usage systémique","Perfusion continue : Diffuseur sur 12h (respecter Cmax)\nAdministration discontinue : Gravité 30 min","Perfusion continue : Diffuseur sur 12h (respecter Cmax)\nAdministration discontinue : Gravité 30 min","Perfusion continue : Diffuseur sur 12h (respecter Cmax)\nAdministration discontinue : Gravité 30 min","Perfusion continue : Diffuseur sur 12h (respecter Cmax)\nAdministration discontinue : Gravité 30 min","Perfusion continue : Diffuseur sur 12h (respecter Cmax)\nAdministration discontinue : Gravité 30 min",null,"Pas de modalité alternative","Pas de modalité alternative","Pas de modalité alternative",null,"Conformité du mode d'administration","Conformité du mode d'administration","Non Conformité du mode d'administration"]
["CEFTAZIDIME","Dose non renseignée","CEFTAZIDIMEDose non renseignée","CEFTAZIDIMEDose non renseignée_NP","NP","Antiinfectieux généraux à usage systémique","Perfusion continue : Diffuseur sur 12h (respecter Cmax)\nAdministration discontinue : Gravité 30 min","Perfusion continue : Diffuseur sur 12h (respecter Cmax)\nAdministration discontinue : Gravité 30 min","Perfusion continue : Diffuseur sur 12h (respecter Cmax)\nAdministration discontinue : Gravité 30 min","Perfusion continue : Diffuseur sur 12h (respecter Cmax)\nAdministration discontinue : Gravité 30 min","Perfusion continue : Diffuseur sur 12h (respecter Cmax)\nAdministration discontinue : Gravité 30 min",null,"Pas de modalité alternative","Pas de modalité alternative","Pas de modalité alternative",null,"Conformité du mode d'administration","Conformité du mode d'administration","Non Conformité du mode d'administration"]
["CEFTRIAXONE","Toutes doses","CEFTRIAXONEToutes doses","CEFTRIAXONEToutes doses_NP","NP","Antiinfectieux généraux à usage systémique","Gravité 30 minutes","Gravité 30 minutes","Gravité 30 minutes","Gravité 30 minutes","Gravité 30 minutes",null,"Pas de modalité alternative","Pas de modalité alternative","Pas de modalité alternative",null,"Conformité du mode d'administration","Non Conformité du mode d'administration","Non Conformité du mode d'administration"]
["CEFTRIAXONE","Dose non renseignée","CEFTRIAXONEDose non renseignée","CEFTRIAXONEDose non renseignée_NP","NP","Antiinfectieux généraux à usage systémique","Gravité 30 minutes","Gravité 30 minutes","Gravité 30 minutes","Gravité 30 minutes","Gravité 30 minutes",null,"Pas de modalité alternative","Pas de modalité alternative","Pas de modalité alternative",null,"Conformité du mode d'administration","Non Conformité du mode d'administration","Non Conformité du mode d'administration"]
["CHLORURE DE SODIUM","Toutes doses","CHLORURE DE SODIUMToutes doses","CHLORURE DE SODIUMToutes doses_NP","NP","Sang et organes hématopoïétique","IV : Gravité\nSC : Gravité\n1500mL à 2000mL /24h/site injection ou 1000mL/8h la nuit ou 500mL/2h","IV : Gravité\nSC : Gravité\n1500mL à 2000mL /24h/site injection ou 1000mL/8h la nuit ou 500mL/2h","IV : Gravité\nSC : Gravité\n1500mL à 2000mL /24h/site injection ou 1000mL/8h la nuit ou 500mL/2h","IV : Gravité\nSC : Gravité\n1500mL à 2000mL /24h/site injection ou 1000mL/8h la nuit ou 500mL/2h","IV : Gravité\nSC : Gravité\n1500mL à 2000mL /24h/site injection ou 1000mL/8h la nuit ou 500mL/2h",null,"Pas de modalité alternative","Pas de modalité alternative","Pas de modalité alternative",null,"Conformité du mode d'administration","Non Conformité du mode d'administration","Non Conformité du mode d'administration"]
["CHLORURE DE SODIUM","Dose non renseignée","CHLORURE DE SODIUMDose non renseignée","CHLORURE DE SODIUMDose non renseignée_NP","NP","Sang et organes hématopoïétique","IV : Gravité\nSC : Gravité\n1500mL à 2000mL /24h/site injection ou 1000mL/8h la nuit ou 500mL/2h","IV : Gravité\nSC : Gravité\n1500mL à 2000mL /24h/site injection ou 1000mL/8h la nuit ou 500mL/2h","IV : Gravité\nSC : Gravité\n1500mL à 2000mL /24h/site injection ou 1000mL/8h la nuit ou 500mL/2h","IV : Gravité\nSC : Gravité\n1500mL à 2000mL /24h/site injection ou 1000mL/8h la nuit ou 500mL/2h","IV : Gravité\nSC : Gravité\n1500mL à 2000mL /24h/site injection ou 1000mL/8h la nuit ou 500mL/2h",null,"Pas de modalité alternative","Pas de modalité alternative","Pas de modalité alternative",null,"Conformité du mode d'administration","Non Conformité du mode d'administration","Non Conformité du mode d'administration"]
["ERTAPENEME","Toutes doses","ERTAPENEMEToutes doses","ERTAPENEMEToutes doses_NP","NP","Antiinfectieux généraux à usage systémique","Gravité 30 min","Gravité 30 min","Gravité 30 min","Gravité 30 min","Gravité 30 min",null,"Pas de modalité alternative","Pas de modalité alternative","Pas de modalité alternative",null,"Conformité du mode d'administration","Non Conformité du mode d'administration","Non Conformité du mode d'administration"]
["ERTAPENEME","Dose non renseignée","ERTAPENEMEDose non renseignée","ERTAPENEMEDose non renseignée_NP","NP","Antiinfectieux généraux à usage systémique","Gravité 30 min","Gravité 30 min","Gravité 30 min","Gravité 30 min","Gravité 30 min",null,"Pas de modalité alternative","Pas de modalité alternative","Pas de modalité alternative",null,"Conformité du mode d'administration","Non Conformité du mode d'administration","Non Conformité du mode d'administration"]
["GENTAMICINE","Toutes doses","GENTAMICINEToutes doses","GENTAMICINEToutes doses_NP","NP","Antiinfectieux généraux à usage systémique","Gravité 30 min","Gravité 30 min","Gravité 30 min","Gravité 30 min","Gravité 30 min",null,"Pas de modalité alternative","Pas de modalité alternative","Pas de modalité alternative",null,"Conformité du mode d'administration","Non Conformité du mode d'administration","Non Conformité du mode d'administration"]
["GENTAMICINE","Dose non renseignée","GENTAMICINEDose non renseignée","GENTAMICINEDose non renseignée_NP","NP","Antiinfectieux généraux à usage systémique","Gravité 30 min","Gravité 30 min","Gravité 30 min","Gravité 30 min","Gravité 30 min",null,"Pas de modalité alternative","Pas de modalité alternative","Pas de modalité alternative",null,"Conformité du mode d'administration","Non Conformité du mode d'administration","Non Conformité du mode d'administration"]
["HEPARINE SODIQUE","Toutes doses","HEPARINE SODIQUEToutes doses","HEPARINE SODIQUEToutes doses_NP","NP","Sang et organes hématopoïétique","Administration en bolus : IVD lente\nPosologie initiale et entretien : PSE","Administration en bolus : IVD lente\nPosologie initiale et entretien : PSE","Administration en bolus : IVD lente\nPosologie initiale et entretien : PSE","Administration en bolus : IVD lente\nPosologie initiale et entretien : PSE","Administration en bolus : IVD lente\nPosologie initiale et entretien : PSE",null,"Pas de modalité alternative","Pas de modalité alternative","Pas de modalité alternative",null,"Non Conformité du mode d'administration","Non Conformité du mode d'administration","Conformité du mode d'administration"]
["HEPARINE SODIQUE","Dose non renseignée","HEPARINE SODIQUEDose non renseignée","HEPARINE SODIQUEDose non renseignée_NP","NP","Sang et organes hématopoïétique","Administration en bolus : IVD lente\nPosologie initiale et entretien : PSE","Administration en bolus : IVD lente\nPosologie initiale et entretien : PSE","Administration en bolus : IVD lente\nPosologie initiale et entretien : PSE","Administration en bolus : IVD lente\nPosologie initiale et entretien : PSE","Administration en bolus : IVD lente\nPosologie initiale et entretien : PSE",null,"Pas de modalité alternative","Pas de modalité alternative","Pas de modalité alternative",null,"Non Conformité du mode d'administration","Non Conformité du mode d'administration","Conformité du mode d'administration"]
["HYDRATE DE CARBONE SOLUTE GLUCOSE","Toutes doses","HYDRATE DE CARBONE SOLUTE GLUCOSEToutes doses","HYDRATE DE CARBONE SOLUTE GLUCOSEToutes doses_NP","NP","Sang et organes hématopoïétique","IV : Gravité\nSC : Gravité\n1500mL à 2000mL /24h/site injection\nou 1000mL/8h la nuit\nou 500mL/2h","IV : Gravité\nSC : Gravité\n1500mL à 2000mL /24h/site injection\nou 1000mL/8h la nuit\nou 500mL/2h","IV : Gravité\nSC : Gravité\n1500mL à 2000mL /24h/site injection\nou 1000mL/8h la nuit\nou 500mL/2h","IV : Gravité\nSC : Gravité\n1500mL à 2000mL /24h/site injection\nou 1000mL/8h la nuit\nou 500mL/2h","IV : Gravité\nSC : Gravité\n1500mL à 2000mL /24h/site injection\nou 1000mL/8h la nuit\nou 500mL/2h",null,"Pas de modalité alternative","Pas de modalité alternative","Pas de modalité alternative",null,"Conformité du mode d'administration","Non Conformité du mode d'administration","Non Conformité du mode d'administration"]
["HYDRATE DE CARBONE SOLUTE GLUCOSE","Dose non renseignée","HYDRATE DE CARBONE SOLUTE GLUCOSEDose non renseignée","HYDRATE DE CARBONE SOLUTE GLUCOSEDose non renseignée_NP","NP","Sang et organes hématopoïétique","IV : Gravité\nSC : Gravité\n1500mL à 2000mL /24h/site injection\nou 1000mL/8h la nuit\nou 500mL/2h","IV : Gravité\nSC : Gravité\n1500mL à 2000mL /24h/site injection\nou 1000mL/8h la nuit\nou 500mL/2h","IV : Gravité\nSC : Gravité\n1500mL à 2000mL /24h/site injection\nou 1000mL/8h la nuit\nou 500mL/2h","IV : Gravité\nSC : Gravité\n1500mL à 2000mL /24h/site injection\nou 1000mL/8h la nuit\nou 500mL/2h","IV : Gravité\nSC : Gravité\n1500mL à 2000mL /24h/site injection\nou 1000mL/8h la nuit\nou 500mL/2h",null,"Pas de modalité alternative","Pas de modalité alternative","Pas de modalité alternative",null,"Conformité du mode d'administration","Non Conformité du mode d'administration","Non Conformité du mode d'administration"]
["HYDRATE DE CARBONE SOLUTE GLUCOSE POLYIONIQUE PRETS À L EMPLOI","Toutes doses","HYDRATE DE CARBONE SOLUTE GLUCOSE POLYIONIQUE PRETS À L EMPLOIToutes doses","HYDRATE DE CARBONE SOLUTE GLUCOSE POLYIONIQUE PRETS À L EMPLOIToutes doses_NP","NP","Sang et organes hématopoïétique","IV : Gravité\n1500mL à 2000mL /24h/site injection\nou 1000mL/8h la nuit\nou 500mL/2h","IV : Gravité\n1500mL à 2000mL /24h/site injection\nou 1000mL/8h la nuit\nou 500mL/2h","IV : Gravité\n1500mL à 2000mL /24h/site injection\nou 1000mL/8h la nuit\nou 500mL/2h","IV : Gravité\n1500mL à 2000mL /24h/site injection\nou 1000mL/8h la nuit\nou 500mL/2h","IV : Gravité\n1500mL à 2000mL /24h/site injection\nou 1000mL/8h la nuit\nou 500mL/2h",null,"Pas de modalité alternative","Pas de modalité alternative","Pas de modalité alternative",null,"Conformité du mode d'administration","Non Conformité du mode d'administration","Non Conformité du mode d'administration"]
["HYDRATE DE CARBONE SOLUTE GLUCOSE POLYIONIQUE PRETS À L EMPLOI","Dose non renseignée","HYDRATE DE CARBONE SOLUTE GLUCOSE POLYIONIQUE PRETS À L EMPLOIDose non renseignée","HYDRATE DE CARBONE SOLUTE GLUCOSE POLYIONIQUE PRETS À L EMPLOIDose non renseignée_NP","NP","Sang et organes hématopoïétique","IV : Gravité\n1500mL à 2000mL /24h/site injection\nou 1000mL/8h la nuit\nou 500mL/2h","IV : Gravité\n1500mL à 2000mL /24h/site injection\nou 1000mL/8h la nuit\nou 500mL/2h","IV : Gravité\n1500mL à 2000mL /24h/site injection\nou 1000mL/8h la nuit\nou 500mL/2h","IV : Gravité\n1500mL à 2000mL /24h/site injection\nou 1000mL/8h la nuit\nou 500mL/2h","IV : Gravité\n1500mL à 2000mL /24h/site injection\nou 1000mL/8h la nuit\nou 500mL/2h",null,"Pas de modalité alternative","Pas de modalité alternative","Pas de modalité alternative",null,"Conformité du mode d'administration","Non Conformité du mode d'administration","Non Conformité du mode d'administration"]
["IMIPENEME CILASTATINE","Toutes doses","IMIPENEME CILASTATINEToutes doses","IMIPENEME CILASTATINEToutes doses_NP","NP","Antiinfectieux généraux à usage systémique","Dose ≤ 500mg : Gravité 20-30 min \nDose > 500mg : Gravité 40-60 min","Dose ≤ 500mg : Gravité 20-30 min \nDose > 500mg : Gravité 40-60 min","Dose ≤ 500mg : Gravité 20-30 min \nDose > 500mg : Gravité 40-60 min","Dose ≤ 500mg : Gravité 20-30 min \nDose > 500mg : Gravité 40-60 min","Dose ≤ 500mg : Gravité 20-30 min \nDose > 500mg : Gravité 40-60 min",null,"Pas de modalité alternative","Pas de modalité alternative","Pas de modalité alternative",null,"Conformité du mode d'administration","Non Conformité du mode d'administration","Non Conformité du mode d'administration"]
["IMIPENEME CILASTATINE","Dose non renseignée","IMIPENEME CILASTATINEDose non renseignée","IMIPENEME CILASTATINEDose non renseignée_NP","NP","Antiinfectieux généraux à usage systémique","Dose ≤ 500mg : Gravité 20-30 min \nDose > 500mg : Gravité 40-60 min","Dose ≤ 500mg : Gravité 20-30 min \nDose > 500mg : Gravité 40-60 min","Dose ≤ 500mg : Gravité 20-30 min \nDose > 500mg : Gravité 40-60 min","Dose ≤ 500mg : Gravité 20-30 min \nDose > 500mg : Gravité 40-60 min","Dose ≤ 500mg : Gravité 20-30 min \nDose > 500mg : Gravité 40-60 min",null,"Pas de modalité alternative","Pas de modalité alternative","Pas de modalité alternative",null,"Conformité du mode d'administration","Non Conformité du mode d'administration","Non Conformité du mode d'administration"]
["IMMUNOGLOBULINES POLYVALENTES IV","Toutes doses","IMMUNOGLOBULINES POLYVALENTES IVToutes doses","IMMUNOGLOBULINES POLYVALENTES IVToutes doses_NP","NP","Antiinfectieux généraux à usage systémique","Pompe","Pompe","Pompe","Pompe","Pompe",null,"Pas de modalité alternative","Pas de modalité alternative","Pas de modalité alternative",null,"Non Conformité du mode d'administration","Non Conformité du mode d'administration","Conformité du mode d'administration"]
["IMMUNOGLOBULINES POLYVALENTES IV","Dose non renseignée","IMMUNOGLOBULINES POLYVALENTES IVDose non renseignée","IMMUNOGLOBULINES POLYVALENTES IVDose non renseignée_NP","NP","Antiinfectieux généraux à usage systémique","Pompe","Pompe","Pompe","Pompe","Pompe",null,"Pas de modalité alternative","Pas de modalité alternative","Pas de modalité alternative",null,"Non Conformité du mode d'administration","Non Conformité du mode d'administration","Conformité du mode d'administration"]
["IMMUNOGLOBULINES POLYVALENTES SC","Toutes doses","IMMUNOGLOBULINES POLYVALENTES SCToutes doses","IMMUNOGLOBULINES POLYVALENTES SCToutes doses_NP","NP","Antiinfectieux généraux à usage systémique","Pompe ou PSE","Pompe ou PSE","Pompe ou PSE","Pompe ou PSE","Pompe ou PSE",null,"Pas de modalité alternative","Pas de modalité alternative","Pas de modalité alternative",null,"Non Conformité du mode d'administration","Non Conformité du mode d'administration","Conformité du mode d'administration"]
["IMMUNOGLOBULINES POLYVALENTES SC","Dose non renseignée","IMMUNOGLOBULINES POLYVALENTES SCDose non renseignée","IMMUNOGLOBULINES POLYVALENTES SCDose non renseignée_NP","NP","Antiinfectieux généraux à usage systémique","Pompe ou PSE","Pompe ou PSE","Pompe ou PSE","Pompe ou PSE","Pompe ou PSE",null,"Pas de modalité alternative","Pas de modalité alternative","Pas de modalité alternative",null,"Non Conformité du mode d'administration","Non Conformité du mode d'administration","Conformité du mode d'administration"]
["MEDICAMENT NON INTEGRE AU GUIDE DU ResOMeDIT","Toutes doses","MEDICAMENT NON INTEGRE AU GUIDE DU ResOMeDITToutes doses","MEDICAMENT NON INTEGRE AU GUIDE DU ResOMeDITToutes doses_NP","NP",null,null,null,null,null,null,null,"Pas de modalité alternative","Pas de modalité alternative","Pas de modalité alternative",null,"Situation non intégrée dans le guide ResOMeDIT","Situation non intégrée dans le guide ResOMeDIT","Situation non intégrée dans le guide ResOMeDIT"]
["MEDICAMENT NON INTEGRE AU GUIDE DU ResOMeDIT","Dose non renseignée","MEDICAMENT NON INTEGRE AU GUIDE DU ResOMeDITDose non renseignée","MEDICAMENT NON INTEGRE AU GUIDE DU ResOMeDITDose non renseignée_NP","NP",null,null,null,null,null,null,null,"Pas de modalité alternative","Pas de modalité alternative","Pas de modalité alternative",null,"Situation non intégrée dans le guide ResOMeDIT","Situation non intégrée dans le guide ResOMeDIT","Situation non intégrée dans le guide ResOMeDIT"]
["MEROPENEME","1g","MEROPENEME1g","MEROPENEME1g_NP","NP","Antiinfectieux généraux à usage systémique","1gx3/j : Gravité 30 min","1gx3/j : Gravité 30 min","1gx3/j : Gravité 30 min","1gx3/j : Gravité 30 min","1gx3/j : Gravité 30 min",null,"Pas de modalité alternative","Pas de modalité alternative","Pas de modalité alternative",null,"Conformité du mode d'administration","Non Conformité du mode d'administration","Non Conformité du mode d'administration"]
["MEROPENEME","2g","MEROPENEME2g","MEROPENEME2g_NP","NP","Antiinfectieux généraux à usage systémique","2gx3/j : PSE sur 3h à 8h","2gx3/j : PSE sur 3h à 8h","2gx3/j : PSE sur 3h à 8h","2gx3/j : PSE sur 3h à 8h","2gx3/j : PSE sur 3h à 8h",null,"Pas de modalité alternative","Pas de modalité alternative","Pas de modalité alternative",null,"Non Conformité du mode d'administration","Non Conformité du mode d'administration","Conformité du mode d'administration"]
["MEROPENEME","Autres doses","MEROPENEMEAutres doses","MEROPENEMEAutres doses_NP","NP","Antiinfectieux généraux à usage systémique","1gx3/j: Gravité 30 min\n2gx3/j : PSE sur 3h à 8h","1gx3/j: Gravité 30 min\n2gx3/j : PSE sur 3h à 8h","1gx3/j: Gravité 30 min\n2gx3/j : PSE sur 3h à 8h","1gx3/j: Gravité 30 min\n2gx3/j : PSE sur 3h à 8h","1gx3/j: Gravité 30 min\n2gx3/j : PSE sur 3h à 8h",null,"Pas de modalité alternative","Pas de modalité alternative","Pas de modalité alternative",null,"Situation non intégrée dans le guide ResOMeDIT","Situation non intégrée dans le guide ResOMeDIT","Situation non intégrée dans le guide ResOMeDIT"]
["MEROPENEME","Dose non renseignée","MEROPENEMEDose non renseignée","MEROPENEMEDose non renseignée_NP","NP","Antiinfectieux généraux à usage systémique","1gx3/j: Gravité 30 min\n2gx3/j : PSE sur 3h à 8h","1gx3/j: Gravité 30 min\n2gx3/j : PSE sur 3h à 8h","1gx3/j: Gravité 30 min\n2gx3/j : PSE sur 3h à 8h","1gx3/j: Gravité 30 min\n2gx3/j : PSE sur 3h à 8h","1gx3/j: Gravité 30 min\n2gx3/j : PSE sur 3h à 8h",null,"Pas de modalité alternative","Pas de modalité alternative","Pas de modalité alternative",null,"Non conformité : Prescription incomplète","Non conformité : Prescription incomplète","Non conformité : Prescription incomplète"]
["METHYLPREDNISOLONE","Toutes doses","METHYLPREDNISOLONEToutes doses","METHYLPREDNISOLONEToutes doses_NP","NP","Hormones systémiquess","Gravité 20-30 min","Gravité 20-30 min","Gravité 20-30 min","Gravité 20-30 min","Gravité 20-30 min",null,"Pas de modalité alternative","Pas de modalité alternative","Pas de modalité alternative",null,"Conformité du mode d'administration","Non Conformité du mode d'administration","Non Conformité du mode d'administration"]
["METHYLPREDNISOLONE","Dose non renseignée","METHYLPREDNISOLONEDose non renseignée","METHYLPREDNISOLONEDose non renseignée_NP","NP","Hormones systémiquess","Gravité 20-30 min","Gravité 20-30 min","Gravité 20-30 min","Gravité 20-30 min","Gravité 20-30 min",null,"Pas de modalité alternative","Pas de modalité alternative","Pas de modalité alternative",null,"Conformité du mode d'administration","Non Conformité du mode d'administration","Non Conformité du mode d'administration"]
["MIDAZOLAM","Toutes doses","MIDAZOLAMToutes doses","MIDAZOLAMToutes doses_NP","NP","Système nerveux","Administration en bolus : IVD lente\nAdministration en continu : PSE","Administration en bolus : IVD lente\nAdministration en continu : PSE","Administration en bolus : IVD lente\nAdministration en continu : PSE","Administration en bolus : IVD lente\nAdministration en continu : PSE","Administration en bolus : IVD lente\nAdministration en continu : PSE",null,"Pas de modalité alternative","Pas de modalité alternative","Pas de modalité alternative",null,"Non Conformité du mode d'administration","Non Conformité du mode d'administration","Conformité du mode d'administration"]
["MIDAZOLAM","Dose non renseignée","MIDAZOLAMDose non renseignée","MIDAZOLAMDose non renseignée_NP","NP","Système nerveux","Administration en bolus : IVD lente\nAdministration en continu : PSE","Administration en bolus : IVD lente\nAdministration en continu : PSE","Administration en bolus : IVD lente\nAdministration en continu : PSE","Administration en bolus : IVD lente\nAdministration en continu : PSE","Administration en bolus : IVD lente\nAdministration en continu : PSE",null,"Pas de modalité alternative","Pas de modalité alternative","Pas de modalité alternative",null,"Non Conformité du mode d'administration","Non Conformité du mode d'administration","Conformité du mode d'administration"]
["MORPHINE","Toutes doses","MORPHINEToutes doses","MORPHINEToutes doses_NP","NP","Système nerveux","Pompe PCA ","Pompe PCA ","Pompe PCA ","Pompe PCA ","Pompe PCA ",null,"Pas de modalité alternative","Pas de modalité alternative","Pas de modalité alternative",null,"Non Conformité du mode d'administration","Non Conformité du mode d'administration","Conformité du mode d'administration"]
["MORPHINE","Dose non renseignée","MORPHINEDose non renseignée","MORPHINEDose non renseignée_NP","NP","Système nerveux","Pompe PCA ","Pompe PCA ","Pompe PCA ","Pompe PCA ","Pompe PCA ",null,"Pas de modalité alternative","Pas de modalité alternative","Pas de modalité alternative",null,"Non Conformité du mode d'administration","Non Conformité du mode d'administration","Conformité du mode d'administration"]
["NEFOPAM","Toutes doses","NEFOPAMToutes doses","NEFOPAMToutes doses_NP","NP","Système nerveux","Gravité 15 à 30 min","Gravité 15 à 30 min","Gravité 15 à 30 min","Gravité 15 à 30 min","Gravité 15 à 30 min",null,"Diffuseur","Pas d'autre modalité alternative","Diffuseur",null,"Conformité du mode d'administration","Modalité alternative d'administration","Non Conformité du mode d'administration"]
["NEFOPAM","Dose non renseignée","NEFOPAMDose non renseignée","NEFOPAMDose non renseignée_NP","NP","Système nerveux","Gravité 15 à 30 min","Gravité 15 à 30 min","Gravité 15 à 30 min","Gravité 15 à 30 min","Gravité 15 à 30 min",null,"Diffuseur","Pas d'autre modalité alternative","Diffuseur",null,"Conformité du mode d'administration","Modalité alternative d'administration","Non Conformité du mode d'administration"]
["OXACILLINE","Toutes doses","OXACILLINEToutes doses","OXACILLINEToutes doses_NP","NP","Antiinfectieux généraux à usage systémique","Perfusion continue : Diffuseur sur 8h (respecter la Cmax)","Perfusion continue : Diffuseur sur 8h (respecter la Cmax)","Perfusion continue : Diffuseur sur 8h (respecter la Cmax)","Perfusion continue : Diffuseur sur 8h (respecter la Cmax)","Perfusion continue : Diffuseur sur 8h (respecter la Cmax)",null,"Pas d'autre modalité alternative","Administration discontinue : Gravité 30 à 60 min","Administration discontinue : Gravité 30 à 60 min",null,"Modalité alternative d'administration","Conformité du mode d'administration","Non Conformité du mode d'administration"]
["OXACILLINE","Dose non renseignée","OXACILLINEDose non renseignée","OXACILLINEDose non renseignée_NP","NP","Antiinfectieux généraux à usage systémique","Perfusion continue : Diffuseur sur 8h (respecter la Cmax)","Perfusion continue : Diffuseur sur 8h (respecter la Cmax)","Perfusion continue : Diffuseur sur 8h (respecter la Cmax)","Perfusion continue : Diffuseur sur 8h (respecter la Cmax)","Perfusion continue : Diffuseur sur 8h (respecter la Cmax)",null,"Pas d'autre modalité alternative","Administration discontinue : Gravité 30 à 60 min","Administration discontinue : Gravité 30 à 60 min",null,"Modalité alternative d'administration","Conformité du mode d'administration","Non Conformité du mode d'administration"]
["OXYCODONE","Toutes doses","OXYCODONEToutes doses","OXYCODONEToutes doses_NP","NP","Système nerveux","Pompe PCA","Pompe PCA","Pompe PCA","Pompe PCA","Pompe PCA",null,"Pas de modalité alternative","Pas de modalité alternative","Pas de modalité alternative",null,"Non Conformité du mode d'administration","Non Conformité du mode d'administration","Conformité du mode d'administration"]
["OXYCODONE","Dose non renseignée","OXYCODONEDose non renseignée","OXYCODONEDose non renseignée_NP","NP","Système nerveux","Pompe PCA","Pompe PCA","Pompe PCA","Pompe PCA","Pompe PCA",null,"Pas de modalité alternative","Pas de modalité alternative","Pas de modalité alternative",null,"Non Conformité du mode d'administration","Non Conformité du mode d'administration","Conformité du mode d'administration"]
["PIPERACILLINE-TAZOBACTAM","Toutes doses","PIPERACILLINE-TAZOBACTAMToutes doses","PIPERACILLINE-TAZOBACTAMToutes doses_NP","NP","Antiinfectieux généraux à usage systémique","En cas d'administration discontinue : Gravité 30 min\nEn cas de perfusion continue : Diffuseur sur 24h (respecter la Cmax)","En cas d'administration discontinue : Gravité 30 min\nEn cas de perfusion continue : Diffuseur sur 24h (respecter la Cmax)","En cas d'administration discontinue : Gravité 30 min\nEn cas de perfusion continue : Diffuseur sur 24h (respecter la Cmax)","En cas d'administration discontinue : Gravité 30 min\nEn cas de perfusion continue : Diffuseur sur 24h (respecter la Cmax)","En cas d'administration discontinue : Gravité 30 min\nEn cas de perfusion continue : Diffuseur sur 24h (respecter la Cmax)",null,"Pas de modalité alternative","Pas de modalité alternative","Pas de modalité alternative",null,"Conformité du mode d'administration","Conformité du mode d'administration","Non Conformité du mode d'administration"]
["PIPERACILLINE-TAZOBACTAM","Dose non renseignée","PIPERACILLINE-TAZOBACTAMDose non renseignée","PIPERACILLINE-TAZOBACTAMDose non renseignée_NP","NP","Antiinfectieux généraux à usage systémique","En cas d'administration discontinue : Gravité 30 min\nEn cas de perfusion continue : Diffuseur sur 24h (respecter la Cmax)","En cas d'administration discontinue : Gravité 30 min\nEn cas de perfusion continue : Diffuseur sur 24h (respecter la Cmax)","En cas d'administration discontinue : Gravité 30 min\nEn cas de perfusion continue : Diffuseur sur 24h (respecter la Cmax)","En cas d'administration discontinue : Gravité 30 min\nEn cas de perfusion continue : Diffuseur sur 24h (respecter la Cmax)","En cas d'administration discontinue : Gravité 30 min\nEn cas de perfusion continue : Diffuseur sur 24h (respecter la Cmax)",null,"Pas de modalité alternative","Pas de modalité alternative","Pas de modalité alternative",null,"Conformité du mode d'administration","Conformité du mode d'administration","Non Conformité du mode d'administration"]
["ROPIVACAINE","Toutes doses","ROPIVACAINEToutes doses","ROPIVACAINEToutes doses_NP","NP","Système nerveux","Pompe PCA ou Diffuseur","Pompe PCA ou Diffuseur","Pompe PCA ou Diffuseur","Pompe PCA ou Diffuseur","Pompe PCA ou Diffuseur",null,"Pas de modalité alternative","Pas de modalité alternative","Pas de modalité alternative",null,"Non Conformité du mode d'administration","Conformité du mode d'administration","Conformité du mode d'administration"]
["ROPIVACAINE","Dose non renseignée","ROPIVACAINEDose non renseignée","ROPIVACAINEDose non renseignée_NP","NP","Système nerveux","Pompe PCA ou Diffuseur","Pompe PCA ou Diffuseur","Pompe PCA ou Diffuseur","Pompe PCA ou Diffuseur","Pompe PCA ou Diffuseur",null,"Pas de modalité alternative","Pas de modalité alternative","Pas de modalité alternative",null,"Non Conformité du mode d'administration","Conformité du mode d'administration","Conformité du mode d'administration"]
["TEICOPLANINE","Toutes doses","TEICOPLANINEToutes doses","TEICOPLANINEToutes doses_NP","NP","Antiinfectieux généraux à usage systémique","Gravité 30 min","Gravité 30 min","Gravité 30 min","Gravité 30 min","Gravité 30 min",null,"Pas de modalité alternative","Pas de modalité alternative","Pas de modalité alternative",null,"Conformité du mode d'administration","Non Conformité du mode d'administration","Non Conformité du mode d'administration"]
["TEICOPLANINE","Dose non renseignée","TEICOPLANINEDose non renseignée","TEICOPLANINEDose non renseignée_NP","NP","Antiinfectieux généraux à usage systémique","Gravité 30 min","Gravité 30 min","Gravité 30 min","Gravité 30 min","Gravité 30 min",null,"Pas de modalité alternative","Pas de modalité alternative","Pas de modalité alternative",null,"Conformité du mode d'administration","Non Conformité du mode d'administration","Non Conformité du mode d'administration"]
["TEMOCILLINE","Toutes doses","TEMOCILLINEToutes doses","TEMOCILLINEToutes doses_NP","NP","Antiinfectieux généraux à usage systémique","Perfusion continue : Diffuseur sur 24 h (respecter Cmax)\nAdministration discontinue : Gravité 30 min","Perfusion continue : Diffuseur sur 24 h (respecter Cmax)\nAdministration discontinue : Gravité 30 min","Perfusion continue : Diffuseur sur 24 h (respecter Cmax)\nAdministration discontinue : Gravité 30 min","Perfusion continue : Diffuseur sur 24 h (respecter Cmax)\nAdministration discontinue : Gravité 30 min","Perfusion continue : Diffuseur sur 24 h (respecter Cmax)\nAdministration discontinue : Gravité 30 min",null,"Pas de modalité alternative","Pas de modalité alternative","Pas de modalité alternative",null,"Conformité du mode d'administration","Conformité du mode d'administration","Non Conformité du mode d'administration"]
["TEMOCILLINE","Dose non renseignée","TEMOCILLINEDose non renseignée","TEMOCILLINEDose non renseignée_NP","NP","Antiinfectieux généraux à usage systémique","Perfusion continue : Diffuseur sur 24 h (respecter Cmax)\nAdministration discontinue : Gravité 30 min","Perfusion continue : Diffuseur sur 24 h (respecter Cmax)\nAdministration discontinue : Gravité 30 min","Perfusion continue : Diffuseur sur 24 h (respecter Cmax)\nAdministration discontinue : Gravité 30 min","Perfusion continue : Diffuseur sur 24 h (respecter Cmax)\nAdministration discontinue : Gravité 30 min","Perfusion continue : Diffuseur sur 24 h (respecter Cmax)\nAdministration discontinue : Gravité 30 min",null,"Pas de modalité alternative","Pas de modalité alternative","Pas de modalité alternative",null,"Conformité du mode d'administration","Conformité du mode d'administration","Non Conformité du mode d'administration"]
["TOBRAMYCINE","Toutes doses","TOBRAMYCINEToutes doses","TOBRAMYCINEToutes doses_NP","NP","Antiinfectieux généraux à usage systémique","Gravité 30 min","Gravité 30 min","Gravité 30 min","Gravité 30 min","Gravité 30 min",null,"Pas de modalité alternative","Pas de modalité alternative","Pas de modalité alternative",null,"Conformité du mode d'administration","Non Conformité du mode d'administration","Non Conformité du mode d'administration"]
["TOBRAMYCINE","Dose non renseignée","TOBRAMYCINEDose non renseignée","TOBRAMYCINEDose non renseignée_NP","NP","Antiinfectieux généraux à usage systémique","Gravité 30 min","Gravité 30 min","Gravité 30 min","Gravité 30 min","Gravité 30 min",null,"Pas de modalité alternative","Pas de modalité alternative","Pas de modalité alternative",null,"Conformité du mode d'administration","Non Conformité du mode d'administration","Non Conformité du mode d'administration"]
["VANCOMYCINE","Toutes doses","VANCOMYCINEToutes doses","VANCOMYCINEToutes doses_NP","NP","Antiinfectieux généraux à usage systémique","Perfusion continue sur voie veineuse centrale : Diffuseur sur 24h (respecter Cmax)","Perfusion continue sur voie veineuse centrale : Diffuseur sur 24h (respecter Cmax)","Perfusion continue sur voie veineuse centrale : Diffuseur sur 24h (respecter Cmax)","Perfusion continue sur voie veineuse centrale : Diffuseur sur 24h (respecter Cmax)","Perfusion continue sur voie veineuse centrale : Diffuseur sur 24h (respecter Cmax)",null,"Pas d'autre modalité alternative","Administration discontinue sur voie veineuse périphérique : Gravité 60 min","Administration discontinue sur voie veineuse périphérique : Gravité 60 min",null,"Modalité alternative d'administration","Conformité du mode d'administration","Non Conformité du mode d'administration"]
["VANCOMYCINE","Dose non renseignée","VANCOMYCINEDose non renseignée","VANCOMYCINEDose non renseignée_NP","NP","Antiinfectieux généraux à usage systémique","Perfusion continue sur voie veineuse centrale : Diffuseur sur 24h (respecter Cmax)","Perfusion continue sur voie veineuse centrale : Diffuseur sur 24h (respecter Cmax)","Perfusion continue sur voie veineuse centrale : Diffuseur sur 24h (respecter Cmax)","Perfusion continue sur voie veineuse centrale : Diffuseur sur 24h (respecter Cmax)","Perfusion continue sur voie veineuse centrale : Diffuseur sur 24h (respecter Cmax)",null,"Pas d'autre modalité alternative","Administration discontinue sur voie veineuse périphérique : Gravité 60 min","Administration discontinue sur voie veineuse périphérique : Gravité 60 min",null,"Modalité alternative d'administration","Conformité du mode d'administration","Non Conformité du mode d'administration"]

{"sheet":"TCDSUPCONF","index":15,"n_rows":19,"n_cols":4,"rows_kept":19,"cut":false,"hidden":true,"merged":[]}
[]
[]
[]
[]
[]
[]
[]
[]
[]
[]
[]
[]
["DCI","(vide)"]
[]
["Nombre de Conformité",null,"Conformité"]
["Format du support de prescription","Type de support de prescription","(vide)","Total général"]
["(vide)"]
["(vide)","(vide)"]
["Total général"]

{"sheet":"TCDSUP","index":16,"n_rows":16,"n_cols":4,"rows_kept":16,"cut":false,"hidden":true,"merged":[]}
[]
[]
[]
[]
[]
[]
[]
[]
[]
[]
[]
[]
["DCI","(vide)"]
[]
["Format du support de prescription","Type de support de prescription","Nombre de Conformité","Nombre de Conformité2"]
["(vide)","(vide)",null,{"$error":"#DIV/0!"}]

{"sheet":"TCDCONF","index":17,"n_rows":16,"n_cols":2,"rows_kept":16,"cut":false,"hidden":true,"merged":[]}
[]
[]
[]
[]
[]
[]
[]
[]
[]
[]
[]
[]
["DCI","(vide)"]
[]
["Conformité","Nombre de Conformité"]
["(vide)"]

{"sheet":"TCDADMCONF","index":18,"n_rows":18,"n_cols":3,"rows_kept":18,"cut":false,"hidden":true,"merged":[]}
[]
[]
[]
[]
[]
[]
[]
[]
[]
[]
[]
[]
["DCI","(vide)"]
[]
["Nombre de Conformité","Conformité"]
["Mode d'administration","(vide)","Total général"]
["Non saisi"]
["Total général"]

{"sheet":"TCDADM","index":19,"n_rows":16,"n_cols":3,"rows_kept":16,"cut":false,"hidden":true,"merged":[]}
[]
[]
[]
[]
[]
[]
[]
[]
[]
[]
[]
[]
["DCI","(vide)"]
[]
["Mode d'administration","Nombre de Conformité","Nombre de Conformité2"]
["Non saisi",null,{"$error":"#DIV/0!"}]

{"sheet":"TCDSERV","index":20,"n_rows":16,"n_cols":3,"rows_kept":16,"cut":false,"hidden":true,"merged":[]}
[]
[]
[]
[]
[]
[]
[]
[]
[]
[]
[]
[]
["DCI","(vide)"]
[]
["Service Prescripteur","Nombre de Conformité","Nombre de Conformité2"]
["(vide)",null,{"$error":"#DIV/0!"}]

{"sheet":"TCDSERVCONF","index":21,"n_rows":17,"n_cols":2,"rows_kept":17,"cut":false,"hidden":true,"merged":[]}
[]
[]
[]
[]
[]
[]
[]
[]
[]
[]
[]
[]
["DCI","(vide)"]
[]
["Nombre de Conformité","Conformité"]
["Service Prescripteur","(vide)"]
["(vide)"]

{"sheet":"ETB","index":22,"n_rows":286,"n_cols":11,"rows_kept":286,"cut":false,"hidden":true,"merged":[]}
["RAISONSOCIALE","FINESS","Statut"]
["AAIR",310000633,"autre",null,null,null,null,null,null,null,"autre"]
["AIDER",340000264,"autre",null,null,null,null,null,null,null,"psy"]
["ASSOCIATION HOSPITALIERE SAINTE MARIE",630786754,"psy",null,null,null,null,null,null,null,"HAD"]
["BEZIERS HAD",340016476,"HAD",null,null,null,null,null,null,null,"CH"]
["C.C.A. LES HAUTS D'AVIGNON",300002508,"CH",null,null,null,null,null,null,null,"hl"]
["C.H.(EX H.L.) LOUIS CONTE GRAMAT",460780430,"hl",null,null,null,null,null,null,null,"chr"]
["C.H.U. MONTPELLIER",340780477,"chr",null,null,null,null,null,null,null,"SSR"]
["C.H.U. NIMES",300780038,"chr",null,null,null,null,null,null,null,"aut"]
["CAPIO La Croix du Sud",310026927,"CH",null,null,null,null,null,null,null,"can"]
["CENTRE BOUFFARD-VERCELLI",660000605,"SSR"]
["CENTRE DE CONVALESCENCE LE PECH DU SOLEIL",340798552,"SSR"]
["CENTRE DE CONVALESCENCE SAINT CHRISTOPHE",660005166,"SSR"]
["CENTRE DE PNEUMOLOGIE LE SOLEIL CERDAN",660780800,"SSR"]
["CENTRE DE POST CURE 'APRES'",310795463,"psy"]
["CENTRE DE POST-CURE DU PEYRON",300780764,"psy"]
["CENTRE DE POST-CURE LE BOY",480780212,"SSR"]
["CENTRE DU MELEZET",340797596,"SSR"]
["Centre gériatrique des Minimes",310021571,"SSR/HL"]
["CENTRE HELIO MARIN",660780172,"SSR"]
["CENTRE HOSPITALIER  DE LUNEL",340780535,"hl"]
["Centre Hospitalier ALES CEVENNES",300780046,"ch"]
["Centre Hospitalier BAGNOLS SUR CEZE",300780053,"ch"]
["Centre Hospitalier BEZIERS",340780055,"ch"]
["Centre Hospitalier CARCASSONNE",110780061,"ch"]
["Centre Hospitalier CASTELNAUDARY",110780087,"ch"]
["CENTRE HOSPITALIER CLERMONT L'HERAULT",340780543,"hl"]
["Centre Hospitalier Comminges Pyrénées",310780671,"ch"]
["Centre Hospitalier d'Albi",810000331,"ch"]
["Centre Hospitalier d'Ariège Couserans",90781816,"ch"]
["Centre Hospitalier de Bagnères de Bigorre",650780166,"ch"]
["CENTRE HOSPITALIER DE BEDARIEUX",340009893,"hl"]
["Centre Hospitalier de Bigorre",650783160,"ch"]
["Centre Hospitalier de Decazeville",120780085,"ch"]
["Centre hospitalier de Figeac",460780083,"ch"]
["CENTRE HOSPITALIER DE FLORAC",480780139,"hl"]
["Centre Hospitalier de Gimont",320780158,"hl"]
["CENTRE HOSPITALIER DE LANGOGNE",480780162,"CH"]
["Centre Hospitalier de Lannemezan",650780174,"hl"]
["Centre Hospitalier de Lavaur",810000455,"ch"]
["CENTRE HOSPITALIER DE LIMOUX-QUILLAN",110780707,"ch"]
["Centre Hospitalier de Lourdes",650780158,"ch"]
["Centre Hospitalier de Millau",120004528,"ch"]
["Centre Hospitalier de Montauban",820000016,"ch"]
["CENTRE HOSPITALIER DE PEZENAS",340780451,"hl"]
["CENTRE HOSPITALIER DE PRADES",660780271,"hl"]
["Centre Hospitalier de Rodez",120780044,"ch"]
["Centre Hospitalier de Saint-Affrique",120004619,"ch"]
["Centre Hospitalier de Saint-Céré",460780091,"ch"]
["CENTRE HOSPITALIER DE SAINT-PONS",340780469,"hl"]
["Centre Hospitalier de Villefranche de Rouergue",120780069,"ch"]
["Centre Hospitalier des Vallées d'Ariège",90781774,"ch"]
["CENTRE HOSPITALIER DU GERS",320780125,"psy"]
["CENTRE HOSPITALIER FANNY RAMADIER SAINT CHELY",480780121,"HL"]
["CENTRE HOSPITALIER FRANCIS VALS",110781010,"ch"]
["CENTRE HOSPITALIER G. MARCHANT",310780754,"psy"]
["Centre Hospitalier Intercommunal de Castelsarrasin-Moissac",820004950,"ch"]
["Centre Hospitalier Intercommunal de Castres-Mazamet",810000380,"ch"]
["Centre Hospitalier Intercommunal de Lombez-Samatan",320780174,"hl"]
["Centre Hospitalier Jean Coulon Gourdon",460780208,"ch"]
["CENTRE HOSPITALIER LE MAS CAREIRON",300780103,"psy"]
["CENTRE HOSPITALIER LE VIGAN",300780095,"hl"]
["CENTRE HOSPITALIER LEON JEAN GREGORY",660780198,"psy"]
["CENTRE HOSPITALIER LES DEUX RIVES",820000248,"hl"]
["Centre Hospitalier LEZIGNAN-CORBIERES",110780772,"ch"]
["CENTRE HOSPITALIER LODEVE",340780519,"hl"]
["Centre Hospitalier NARBONNE",110780137,"ch"]
["CENTRE HOSPITALIER PAUL COSTE FLORET",340796358,"ch"]
["Centre Hospitalier PERPIGNAN",660780180,"ch"]
["CENTRE HOSPITALIER PONT SAINT ESPRIT",300780079,"hl"]
["Centre Hospitalier PONTEILS",300781010,"ch"]
["CENTRE HOSPITALIER SAINT JACQUES",480780154,"hl"]
["Centre Hospitalier Universitaire de Toulouse",310781406,"chr"]
["CENTRE MEDICAL DE L'EGREGORE AUDAVIE",300017423,"SSR"]
["CENTRE MEDICAL DE L'EGREGORE UGECAM",300012358,"SSR"]
["CENTRE MEDICAL L'ARBIZON",650780398,"SSR"]
["CENTRE MUTUALISTE NEUROLOGIQUE PROPARA",340001064,"SSR"]
["Centre Néphrologique d'occitanie",310002712,"autre"]
["CENTRE ORTHOPEDIQUE MAGUELONE",340000439,"SSR"]
["CENTRE PAUL DOTTIN (ASEI)",310781422,"SSR"]
["Centre Pédiatrique Saint Jacques de MPR",320780323,"SSR"]
["CENTRE POST CURE VAL PYRENE",660780842,"SSR"]
["CENTRE POST-CURE ALCOOLIQUE SAINTE MARIE",480000835,"psy"]
["CENTRE S.S.R. LA CLAUZE",120780135,"SSR"]
["CENTRE SSR LE VALLESPIR (UGECAM)",660780156,"SSR"]
["CH AUCH",320780117,"ch"]
["CH DE CAHORS",460780216,"ch"]
["CH DE CAUSSADE",820000214,"SSR"]
["CH de condom",320780133,"ch"]
["CH DE GRAULHET",810000398,"ch"]
["CH DE MAUVEZIN",320780182,"HL"]
["CH DE MIRANDE",320780190,"hl"]
["CH DE NEGREPELISSE",820000206,"hl"]
["CH Gaillac",810000349,"ch"]
["CH LE MONTAIGU",650780190,"ch"]
["CH MAURICE FENAILLE",120780291,"hl"]
["CH MURET",310786256,"hl"]
["CH NOGARO",320780208,"hl"]
["CH REVEL",310780713,"hl"]
["CH ST GENIEZ D'OLT ET D'AUBRAC",120780093,"hl"]
["CH ST LOUIS AX LES THERMES",90180019,"hl"]
["CH UZES",300780087,"hl"]
["CH VIC-FEZENSAC",320780216,"hl"]
["CHATEAU DE COULORGUES (ASVMT)",300002128,"psy"]
["CHI ESPALION ST LAURENT D'OLT",120780101,"hl"]
["CHI VALLON SALLES LA SOURCE",120780481,"hl"]
["CHS de LEYME",460780554,"psy"]
["CHS FRANCOIS TOSQUELLES",480780147,"psy"]
["CL CAPIO LA CROIX DU SUD",310026927,"CH"]
["Clinique Ambroise Paré",310780382,"CH"]
["CLINIQUE AMBULATOIRE DE LA CEZE",300017498,"HL/CH"]
["CLINIQUE BEAU SOLEIL",340780642,"HL"]
["CLINIQUE BELLE RIVE",300780210,"psy"]
["Clinique Claude Bernard",810000224,"CH"]
["CLINIQUE CLEMENTVILLE",340780675,"CH"]
["Clinique Croix Saint-Michel",820000040,"HL"]
["CLINIQUE D'AUFRERY",310781133,"psy"]
["CLINIQUE DE BEAUPUY",310780390,"psy"]
["Clinique de Font Redonde",460006075,"CH"]
["Clinique de Lagardelle",310781695,"HL"]
["Clinique de l'Union",310780283,"CH"]
["CLINIQUE DE MONTBERON",310780119,"psy"]
["CLINIQUE DE SOINS DE SUITE LE CHRISTINA",110780194,"SSR"]
["CLINIQUE DE VERDAICH",310781984,"SSR"]
["Clinique des Cèdres",310788880,"CH"]
["Clinique des Pyrénées",310786389,"HL"]
["Clinique d'Occitanie",310781505,"CH"]
["CLINIQUE DU CABIROL",310780234,"SSR"]
["CLINIQUE DU CHATEAU DE SEYSSES",310780143,"psy"]
["CLINIQUE DU CHATEAU DE VERNHES",310780374,"SSR"]
["Clinique du Docteur Honore Cave",820000065,"CH"]
["CLINIQUE DU Dr CAUSSE",340780139,"CH"]
["CLINIQUE DU MAS DE ROCHET (UGECAM)",340781608,"HL"]
["CLINIQUE DU PARC",340780667,"CH"]
["CLINIQUE DU PIC SAINT LOUP",340009018,"SSR"]
["Clinique du Pont de Chaume",820000057,"CH"]
["CLINIQUE DU PONT DU GARD",300780244,"psy"]
["CLINIQUE DU PRE",660780248,"psy"]
["CLINIQUE DU QUERCY BELLEVUE",460780042,"SSR"]
["CLINIQUE DU ROUSSILLON",660780735,"psy"]
["CLINIQUE DU SOUFFLE LA SOLANE",660780347,"SSR"]
["CLINIQUE DU SOUFFLE LA VALLONIE",340780568,"HL"]
["CLINIQUE DU SUD",110003118,"SSR"]
["CLINIQUE DU VALLESPIR",660780628,"CH"]
["CLINIQUE DU VIEUX CHATEAU D'OC",310781141,"psy"]
["CLINIQUE FONTFROIDE",340789981,"SSR"]
["CLINIQUE KENNEDY",300781465,"CH"]
["Clinique Korian Val de Saune",310020938,"SSR"]
["CLINIQUE LA CAMARGUE MONT DUPLAN",300781424,"psy"]
["CLINIQUE LA LIRONDE",340780766,"psy"]
["CLINIQUE LA PERGOLA",340780121,"psy"]
["CLINIQUE LA PINEDE",820003218,"SSR"]
["CLINIQUE LA PINEDE ST ESTEVE",660790163,"SSR"]
["CLINIQUE LA RECOUVRANCE",310023007,"SSR"]
["CLINIQUE LE CASTELET",340780857,"SSR"]
["CLINIQUE LE FLORIDE",660781287,"SSR"]
["CLINIQUE LE MILLENAIRE",340015502,"CH"]
["CLINIQUE LE RELAIS CAILLAC",460785900,"SSR"]
["CLINIQUE LES OLIVIERS",300780491,"SSR"]
["CLINIQUE LES SOPHORAS",300780269,"psy"]
["CLINIQUE MALADIES MENTALES D'EMBATS",320780109,"psy"]
["CLINIQUE MALADIES MENTALES LAMPRE",650780729,"psy"]
["CLINIQUE MALADIES MENTALES LE PIETAT",650780737,"psy"]
["CLINIQUE MARIGNY",310781158,"psy"]
["Clinique Monié",310780366,"HL"]
["CLINIQUE MUTUALISTE CATALANE",660006305,"CH"]
["CLINIQUE MUTUALISTE JEAN LEON",340780816,"SSR"]
["CLINIQUE NEURO PSYCHIATRIQUE QUISSAC",300780251,"psy"]
["CLINIQUE NOTRE DAME D'ESPERANCE",660780669,"CH"]
["Clinique Pasteur",310780259,"CH"]
["CLINIQUE PLEIN SOLEIL",340024546,"SSR"]
["CLINIQUE RECH",340780758,"psy"]
["CLINIQUE REFUGE PROTESTANT",810000158,"SSR"]
["Clinique Rive Gauche",310026083,"CH"]
["Clinique Saint Exupéry",310000617,"CH/HL"]
["CLINIQUE SAINT LOUIS",340780717,"HL"]
["CLINIQUE SAINT MICHEL",660780776,"HL"]
["CLINIQUE SAINT PIERRE",660780784,"CH"]
["CLINIQUE SAINT ROCH",310781125,"SSR"]
["CLINIQUE SAINT-ORENS",310790472,"SSR"]
["CLINIQUE SENSEVIA",660780214,"psy"]
["CLINIQUE SSR LE  VAL DES CYGNES",310782396,"SSR"]
["CLINIQUE SSR SUNNY COTTAGE",660781097,"SSR"]
["CLINIQUE ST ANTOINE",340780790,"psy"]
["CLINIQUE ST CLEMENT",340010149,"psy"]
["CLINIQUE ST MARTIN VIGNOGOUL",340780931,"psy"]
["CLINIQUE STELLA",340780782,"psy"]
["CLINIQUE SUPERVALTECH",660780743,"SSR"]
["Clinique Toulouse Lautrec",810101170,"CH"]
["CLINIQUE VIA DOMITIA",340780725,"CH"]
["CLINIQUE  SAINT JEAN",340780634,"CH"]
["CMRF ALBI",810000232,"SSR"]
["CRF BOURGES",340019090,"SSR"]
["CRF DE MONTRODAT",480783034,"SSR"]
["CRF LA PETITE PAIX",340782002,"SSR"]
["CRF LA ROSERAIE",460000060,"SSR"]
["CRF LE VAL D'ORB",340780196,"SSR"]
["CRF MER AIR SOLEIL",660780636,"SSR"]
["CRF MIDI GASCOGNE",820002350,"SSR"]
["CRF SAINT-BLANCARD",320784333,"SSR"]
["CRF STER LAMALOU LES BAINS",340780212,"SSR"]
["CRF STER SAINT CLEMENT DE RIVIERE",340796093,"SSR"]
["CRPA VALENCE D'ALBIGEOIS",810003954,"SSR"]
["CSSR LES TILLEULS À CEIGNAC",120780143,"SSR"]
["DOMAINE DE LA CADENE",310786702,"SSR"]
["EPS DE LOMAGNE",320004310,"hl"]
["FONDATION DU BON SAUVEUR D'ALBY",810100008,"psy"]
["G.C.S. HELP HEMODIALYSE LAPEYRONIE",340019587,"autre"]
["G.C.S. POLE SANITAIRE CERDAN",660010059,"aut"]
["GCS Arcade",650003148,"HAD"]
["GCS CENTRE REEDUCATION GARD RHODANIEN",300014040,"SSR"]
["GCS DIALYSE DU COMMINGES",310022322,"autre"]
["HAD 3G Santé",300013778,"HAD"]
["HAD HOME SANTE",340017847,"HAD"]
["HAD KORIAN PAYS D OVALIE",810007989,"HAD"]
["HAD LOZERE",480001825,"HAD"]
["HAD OIKIA Ales",300013745,"HAD"]
["HAD OIKIA Montpellier",340017839,"HAD"]
["HAD OIKIA Nîmes",300012309,"HAD"]
["HAD sante relais domicile",310021886,"had"]
["HAD UDSMA de Rodez",120783618,"HAD"]
["Hôpital Joseph Ducuing",310788898,"HL/CH"]
["HOPITAL LOZERE",480780097,"ch"]
["HOPITAUX DE LUCHON",310180013,"ch"]
["HOPITAUX DU BASSIN DE THAU",340011295,"ch"]
["Hopital privé Les Franciscaines",300780152,"CH"]
["Institut Claudius Regaud",310789136,"can"]
["INSTITUT DE REINSERTION DES AVEUGLES ARAMAV",300786274,"SSR"]
["Institut Régional du Cancer (ICM)",340780493,"can"]
["INSTITUT SAINT PIERRE",340000025,"HL"]
["KENVAL INSTITUT DE CANCEROLOGIE",300017209,"can"]
["Korian HAD - Pays des 4 Vents",110005394,"HAD"]
["KORIAN LA VERNEDE",110780202,"SSR"]
["KORIAN LE CHÂTEAU",810004200,"SSR"]
["KORIAN MONTVERT",310781174,"SSR"]
["LES JARDINS DE SOPHIA",340789379,"SSR"]
["MAIS ENF DIETETIQUE THERMALE CAPVERN",650780323,"SSR"]
["MAISON DE CONVALESCENCE ET REPOS AL SOLA",660780099,"SSR"]
["MAISON DE REPOS LE CHÂTEAU BLEU",660780370,"SSR"]
["MAISON DE REPOS LE COLOMBIER",340780253,"SSR"]
["MAISON DE REPOS LES TILLEULS",480780287,"SSR"]
["MAISON DE SANTE DE MAILHOL",310780358,"psy"]
["MAISON DE SANTE LA POMAREDE",300780111,"SSR"]
["MECS CASTELNOUVEL (UGECAM)",310780481,"SSR"]
["MRC CHATEAU DE LONGUES AYGUES",820000412,"SSR"]
["NephroCare GARD",300008588,"autre"]
["Néphro DIALYSE SAINT GUILHEM",340009489,"autre"]
["NOUVELLE CLINIQUE BONNEFON",300780137,"HL/CH"]
["PAVILLON LOU CAMIN",820003911,"psy"]
["Pôle Pédiatrique de Cerdagne",660780321,"SSR"]
["POLYCLINIQUE CHAMPEAU",340009885,"CH"]
["Polyclinique de Gascogne",320780067,"CH"]
["CLINIQUE ORMEAU PYRENEES",650002579,"CH"]
["CLINIQUE ORMEAU SITE CENTRE",650780679,"CH"]
["POLYCLINIQUE DES 3 VALLEES",340780147,"HL"]
["Polyclinique du Grand Sud",300788502,"CH"]
["Polyclinique du Sidobre",810101444,"CH"]
["POLYCLINIQUE LE LANGUEDOC",110780228,"CH"]
["POLYCLINIQUE MEDITERRANEE",660780669,"CH"]
["POLYCLINIQUE MONTREAL",110780483,"CH"]
["POLYCLINIQUE PASTEUR",340780154,"CH"]
["POLYCLINIQUE SAINT PRIVAT",340015965,"CH"]
["POLYCLINIQUE SAINT ROCH",340022979,"CH"]
["POLYCLINIQUE SAINT ROCH CABESTANY",660790379,"CH"]
["POLYCLINIQUE SAINTE THERESE",340780741,"CH"]
["Polyclinique Sainte-Barbe",810000448,"HL"]
["POUPONNIERE ANDRE BOUSQUAIROL",310792874,"SSR"]
["SAS CLINIQUE DE MIREMONT",110780152,"psy"]
["SAS Clinique Médipôle Garonne",310780150,"CH"]
["SAS FMEGF NEWCO 1",940023823,"autre"]
["SAS FMEGF NEWCO 2",940023831,"autre"]
["SAS FMEGF NEWCO 3",940023849,"autre"]
["SAS FMEGF NEWCO 4",940023856,"autre"]
["SSR BEAUSEJOUR",460006349,"SSR"]
["SSR CENTRE DE LORDAT",110007630,"SSR"]
["SSR DEFICIENTS VISUELS ET BASSE VISION (ASEI)",310014329,"SSR"]
["SSR DOMAINE DU CROS",300781440,"SSR"]
["SSR GERIATRIQUE LES CADIERES",300002169,"SSR"]
["SSR LE MARQUISAT",310792635,"SSR"]
["SSR LES CHATAIGNIERS",300780442,"SSR"]
["SSR LES QUATRE FONTAINES",110004942,"SSR"]
["SSR LES TOUT PETITS",660010349,"SSR"]
["SSR NOTRE DAME",460006083,"SSR"]
["SSR PEDIATRIQUE LES ECUREUILS",480780543,"SSR"]
["SSR SPECIALISE EN PNEUMOLOGIE ANTRENAS",480000793,"SSR"]
["USSAP ASM",110786324,"psy"]